program: Gaussian 09
title: 000218357
version: EM64L-G09RevD.01
frameworkgroup: C1[X(C18H24N2O5)]
method: RPBEPBE
basis: SDD
operation: Freq
keyword: #p
keyword: freq=noraman
keyword: PBEPBE/SDD
title: #p freq=noraman PBEPBE/SDD
converged: YES YES NO NO
title: Mulliken charges:
elementType: O O O O O N N C C C C C C C C C C C C C C C C C C H H H H H H H H H H H H H H H H H H H H H H H H
charge: -0.403935 -0.252504 -0.271470 -0.227792 -0.240554 -0.111866 -0.096994 -0.376706 -0.362521 -0.386986 -0.365722 -0.140181 -0.577550 -0.434433 0.161772 0.150109 0.286619 0.286856 -0.339374 -0.347630 -0.256724 -0.245826 -0.228663 -0.221684 -0.662600 0.200308 0.235588 0.205392 0.221250 0.212280 0.189188 0.185294 0.239268 0.262676 0.265658 0.255004 0.231048 0.208825 0.373761 0.249440 0.277406 0.233744 0.220921 0.233118 0.234946 0.235247 0.254723 0.226541 0.214732
chargesum: 0.00000
title: Mulliken charges with hydrogens summed into heavy atoms:
elementType: O O O O O N N C C C C C C C C C C C C C C C C C C
charge: -0.030174 -0.252504 -0.271470 -0.227792 -0.240554 -0.111866 -0.096994 0.059190 0.064121 0.014482 0.058840 0.122495 -0.056888 0.005440 0.161772 0.150109 0.286619 0.286856 -0.089934 -0.070224 0.197941 -0.012708 0.006283 0.013563 0.033396
polarizability: 2.35102503e+02 1.13477710e+01 2.41112999e+02 -2.84527920e+01 5.12423462e+00 1.92227711e+02
1716.lowfreq: -11.3161 -5.9710 -0.0010 -0.0006 -0.0003 3.1397 11.6720 15.5325 25.7256
frequency: 9.9362 14.3221 25.4176 32.7583 41.3600 47.7896 52.5792 60.0258 75.6561 82.8882 88.9652 105.1250 139.5396 146.2221 173.9918 183.8449 199.5887 209.5538 242.3552 262.9697 273.8234 300.9485 308.0139 319.3941 339.0797 367.8325 379.3225 391.5627 400.4540 412.0723 431.4404 456.8908 478.2293 522.3670 554.8541 579.1733 607.7554 613.1994 616.1405 641.7125 647.8919 695.9981 697.8432 699.4917 739.5064 749.0605 769.1686 774.7396 784.4460 815.2204 848.6689 859.0230 885.3331 904.4135 918.1312 937.1630 948.9477 975.6561 987.9705 989.8659 992.7264 1004.5745 1010.4551 1015.0737 1021.3937 1026.5370 1042.7739 1055.8215 1072.9787 1082.9201 1087.2316 1096.1539 1112.5441 1129.9991 1144.6361 1152.4277 1155.4517 1173.9594 1182.6308 1190.6860 1198.8714 1201.9691 1223.9387 1234.5590 1258.6523 1277.8802 1285.8040 1294.1959 1305.9401 1319.1142 1322.6613 1330.2798 1333.5611 1353.1030 1354.8341 1360.1432 1373.6922 1382.2737 1388.2192 1388.5822 1393.5968 1432.1399 1436.5634 1449.2999 1455.4474 1457.0962 1460.1393 1462.8773 1465.0757 1470.3969 1480.7735 1484.4547 1566.7711 1596.9061 1611.8355 1641.9204 1643.6175 2859.8244 2867.1413 2887.6201 2906.8945 2935.2538 2976.3701 2993.5765 3028.5810 3035.2695 3043.1084 3049.0140 3055.4859 3068.5939 3076.0973 3079.0152 3087.8057 3093.7676 3119.3042 3130.2296 3139.2370 3150.1265 3159.5945 3170.3335 3496.3120
redmass: 5.0909 4.2960 4.9271 4.6675 4.1611 5.0695 4.2617 7.2276 6.0147 3.6002 4.4058 5.0012 4.3972 5.1896 3.8776 2.9288 1.4711 4.1955 3.3939 2.1522 2.4667 5.4048 2.9667 3.2742 4.4802 3.7931 2.8672 2.0756 2.8049 3.2310 4.0371 4.6496 2.7991 3.3490 2.4900 2.6099 1.8463 6.0712 3.9699 2.2524 5.7222 1.8825 3.4690 4.3993 2.9284 2.8999 5.6478 2.2712 3.1158 1.3597 1.5501 1.2513 3.2772 2.8196 2.7509 2.5725 1.6132 3.4044 2.3150 5.9786 1.3821 2.5519 1.5703 2.1496 2.8061 2.2349 2.2386 1.7720 2.2681 2.2685 1.6457 2.1724 2.3117 2.5851 2.5495 2.4420 1.6990 1.0692 1.7552 1.1380 1.1768 1.3169 1.9762 2.0391 1.4744 1.1254 1.3753 1.4879 1.9715 1.3565 1.4597 1.3107 1.3262 1.8948 1.2876 1.3770 1.4535 1.4612 5.2899 1.5902 1.2296 1.1237 2.1899 1.0831 1.0856 1.0905 1.0807 1.0495 1.0887 1.1018 2.1663 1.0512 7.1059 6.7452 6.3449 8.1130 9.3372 1.0709 1.0698 1.0689 1.0691 1.0678 1.0666 1.0363 1.0596 1.0908 1.0901 1.0905 1.0938 1.0886 1.0857 1.0909 1.0976 1.1032 1.1054 1.0852 1.0881 1.0925 1.0961 1.1014 1.0637
irintensity: 0.2465 0.4364 1.2655 0.3815 0.0357 0.8912 0.4405 2.8576 0.9500 3.4795 4.1762 3.1866 0.3694 0.1518 3.0065 1.8084 2.2891 0.1342 1.3352 4.3622 4.0687 6.5757 4.5965 7.4927 3.5483 5.9356 3.5178 1.2399 0.0433 0.7925 9.0752 1.7682 1.1822 75.3655 7.0391 58.1587 63.6612 3.8586 17.2052 10.2750 8.1243 25.8065 74.4124 16.5880 29.6298 19.5236 5.0614 44.9976 5.6642 4.4168 0.8036 0.4689 25.2125 10.2161 0.6753 37.5114 12.3784 18.1776 11.4123 5.0522 0.8849 75.9022 23.4225 76.2488 45.0656 21.8461 128.7184 11.2466 55.6536 12.9054 6.7086 42.3988 133.2395 80.2734 11.7703 22.1390 9.2301 3.8466 43.3305 29.1050 3.3821 16.8208 56.3348 81.3847 21.2157 2.2271 6.3561 54.0400 138.7402 5.1553 25.8421 15.6320 16.6521 13.3675 1.5900 0.9529 8.3986 10.5957 2.9429 16.7080 22.2230 24.2003 24.2224 1.9436 9.8535 13.5570 4.5777 14.6743 27.0063 2.3310 1.4065 16.6350 122.2675 45.4143 9.6338 126.7346 221.3367 56.8450 73.8658 94.5879 112.7623 70.1368 20.4524 16.4117 38.3236 31.4648 14.7805 4.5865 22.2961 10.7071 11.0500 12.7264 41.6584 1.9108 29.7759 0.2664 5.1224 15.8914 17.8805 22.7468 19.5049
temp: 298.150 k
press: 1.00000 atm
elementType: 8 8 8 8 8 7 7 6 6 6 6 6 6 6 6 6 6 6 6 6 6 6 6 6 6 1 1 1 1 1 1 1 1 1 1 1 1 1 1 1 1 1 1 1 1 1 1 1 1
symmnumber: 1
zpe: 1044785.0 jmol-1
zpe.correction: 0.397938 hartree
zpe.thermalcorrener: 0.423242 hartree
zpe.thermalcorrenthalpy: 0.424187 hartree
zpe.thermalcorrgfe: 0.337578 hartree
zpe.sumelectzpe: -1184.019868 hartree
zpe.sumelectthermal: -1183.994563 hartree
zpe.sumelectthermalent: -1183.993619 hartree
zpe.sumelectthermalfe: -1184.080228 hartree
dipole: -2.1238 -0.4388 -0.7140
dipole: 2.2832
quadrupole: -131.8445 -134.5626 -153.0416
quadrupole: 10.3528 -15.3342 2.8580
quadrupole: 7.9717 5.2536 -13.2253 10.3528 -15.3342 2.8580
hfenergy: -1184.4178052 hartree
pointgroup: C01 [X(C18H24N2O5)]
dipole: -0.810169 -0.3507777 0.1657749 debye
polarizability: 241.2699529|-24.1183719|186.1890172|-8.8789765|-2.9436735|240.984243 unknown
InChI: InChI=1S/C18H24N2O5/c1-2-25-17(22)13-19-8-10-20(11-9-19)15(18(23)24)12-16(21)14-6-4-3-5-7-14/h3-7,15,23H,2,8-13H2,1H3
charge 0 multiplicity 1
49 atoms
O  -0.474677 -1.675729 -4.489783
O  -1.296386 0.481909 -4.236407
O  5.25411 0.190072 0.920478
O  -1.238708 -1.739905 0.408825
O  4.980811 2.457959 1.400332
N  0.582118 -0.229971 -1.87032
N  2.963128 1.017644 -0.882715
C  0.615314 1.227522 -1.64384
C  1.49785 -0.977855 -0.980966
C  2.056379 1.74857 -1.800924
C  2.930169 -0.443032 -1.143817
C  -0.715145 -0.850009 -2.218142
C  -1.968193 -0.348691 -1.452914
C  4.332942 1.581297 -0.824455
C  -0.887926 -0.585185 -3.716866
C  -2.044153 -0.855208 -0.010464
C  4.880637 1.49962 0.60153
C  -3.114123 -0.306888 0.890375
C  -4.062923 0.657393 0.452799
C  -3.177075 -0.781774 2.229577
C  5.710239 -0.049221 2.326922
C  -5.052462 1.135533 1.338084
C  -4.163234 -0.302243 3.112793
C  -5.104229 0.658965 2.668789
C  4.513028 -0.261493 3.257218
H  0.257681 1.497337 -0.620649
H  -0.02904 1.72957 -2.388382
H  1.470717 -2.047026 -1.255659
H  1.194868 -0.894334 0.086248
H  2.082569 2.824277 -1.546845
H  2.363128 1.62989 -2.870626
H  3.289618 -0.670996 -2.179476
H  3.598885 -0.945786 -0.424993
H  -0.612036 -1.936384 -2.064198
H  -2.013113 0.754837 -1.483815
H  -2.882081 -0.693142 -1.981437
H  4.296785 2.652444 -1.083067
H  5.035366 1.073924 -1.526148
H  -0.51634 -1.427396 -5.454046
H  -4.038156 1.036177 -0.574255
H  -2.439504 -1.526539 2.546747
H  6.319482 0.814779 2.646274
H  6.339462 -0.949778 2.243466
H  -5.780677 1.877852 0.993953
H  -4.203013 -0.672023 4.143072
H  -5.871924 1.033496 3.35513
H  3.903697 0.654947 3.324785
H  3.875058 -1.087803 2.898691
H  4.87048 -0.515306 4.27262
