program: Gaussian 09
title: 000218331
version: EM64L-G09RevD.01
frameworkgroup: C1[X(C21H27NO2)]
method: RPBEPBE
basis: SDD
operation: Freq
keyword: #p
keyword: freq=noraman
keyword: PBEPBE/SDD
title: #p freq=noraman PBEPBE/SDD
converged: YES YES NO NO
title: Mulliken charges:
elementType: O O N C C C C C C C C C C C C C C C C C C C C C H H H H H H H H H H H H H H H H H H H H H H H H H H H
charge: -0.277543 -0.237367 -0.061943 -0.139214 -0.149644 -0.484751 -0.487569 -0.487881 -0.462273 0.018443 -0.645990 0.274808 -0.724010 0.414705 0.201352 -0.393947 0.347021 -0.489673 -0.632570 -0.378015 -0.404509 -0.438829 -0.254890 -0.240098 0.233221 0.233247 0.231878 0.215704 0.225068 0.232870 0.232012 0.207619 0.235415 0.225533 0.244712 0.195538 0.228652 0.227218 0.245382 0.247455 0.226349 0.261956 0.213265 0.211973 0.207732 0.231722 0.206677 0.228705 0.234395 0.225711 0.224379
chargesum: 0.00000
title: Mulliken charges with hydrogens summed into heavy atoms:
elementType: O O N C C C C C C C C C C C C C C C C C C C C C
charge: -0.277543 -0.237367 -0.061943 0.094007 0.083602 -0.037169 -0.029631 -0.048251 -0.001325 0.263155 0.005419 0.274808 -0.231174 0.414705 0.201352 -0.167598 0.347021 -0.051274 -0.157349 0.041690 -0.175803 -0.204434 -0.029179 -0.015720
polarizability: 2.50094865e+02 1.73654912e+01 2.38635336e+02 -2.35109441e+01 -6.54745060e-01 1.97023331e+02
1716.lowfreq: -14.2780 -7.1605 -2.4321 -0.0008 0.0004 0.0006 6.1441 18.8111 32.5653
frequency: -1.8699 17.4522 31.9880 47.7510 60.1008 71.2444 106.5969 125.1269 154.6161 172.3099 183.5898 184.5606 199.7879 227.4627 236.1906 274.7666 281.3466 289.1713 322.2985 354.4122 358.6525 365.5512 377.1998 413.9174 434.3595 451.0773 472.3594 481.2184 491.7196 510.0147 562.6173 578.1659 595.0500 614.8685 634.9780 683.9850 693.9984 728.3004 740.3350 753.7343 763.9500 769.1026 773.8578 781.8749 816.2343 818.4764 836.2129 839.9773 852.0021 866.2479 876.0221 883.0838 919.7482 930.7087 947.3655 950.2905 960.9688 967.8276 978.8153 981.5432 985.0302 988.6522 1032.7531 1038.1650 1043.1940 1051.8747 1063.5653 1070.6560 1093.0366 1101.5011 1109.3330 1116.2178 1118.9715 1125.7029 1147.8912 1155.8844 1167.9835 1175.5316 1180.4346 1195.4403 1196.3345 1204.8319 1214.4797 1224.0058 1238.3013 1242.3156 1255.5155 1256.2632 1271.4419 1288.2553 1289.9003 1293.8532 1302.2381 1307.9043 1313.4642 1314.2858 1331.3652 1339.6806 1344.3966 1355.1561 1364.9132 1372.8924 1373.0465 1421.6871 1435.2070 1441.9650 1448.4405 1460.6930 1463.0831 1463.6939 1466.0065 1472.1251 1480.8604 1481.0718 1482.1914 1488.7427 1573.2487 1607.8663 1631.7219 1653.1412 2883.6469 2972.5033 2979.5913 2986.7695 2998.8199 3002.4906 3003.6079 3011.2120 3015.4835 3022.5489 3023.7059 3027.4239 3041.2505 3046.0284 3051.2546 3052.2125 3055.7985 3059.2295 3073.5529 3077.7328 3078.4640 3083.1376 3104.1922 3115.3008 3124.8608 3138.8227 3159.0910
redmass: 4.9072 4.2717 3.6372 4.1091 8.0784 5.1033 3.6710 3.1197 3.6971 4.0391 2.4855 2.0012 1.1334 3.3186 3.6431 2.7248 2.4764 2.5504 3.3790 3.7156 2.6707 2.6852 2.8872 3.5009 3.6099 2.4567 3.2283 3.0780 3.4970 3.6851 3.4215 2.8727 3.9857 3.3505 3.0859 4.6489 4.5727 3.0694 4.4575 2.4439 1.6926 3.2452 1.9598 1.8714 2.1998 2.5071 2.3555 2.2798 2.1485 1.5837 1.9990 2.3616 3.1095 2.4352 1.8015 2.2996 2.0991 2.1859 1.8094 2.3653 1.3720 2.0143 1.9805 2.6396 1.6366 2.5406 2.4866 2.0312 1.9625 1.5973 1.6173 1.8820 2.1133 2.1823 1.2798 2.0487 1.2036 1.0662 1.5908 1.4195 1.4115 1.5448 1.7532 1.4067 1.7307 1.5908 1.2695 1.2895 1.3879 1.4245 1.4762 1.6167 1.3085 1.5910 1.4242 1.3265 1.3821 1.4573 1.4844 1.5161 1.7919 2.4744 1.8687 1.1721 2.2920 1.0966 1.0887 1.0654 1.0837 1.0867 1.0725 1.1761 1.0987 1.0568 2.3286 1.0862 6.3124 6.2042 9.8406 7.9677 1.0530 1.0583 1.0627 1.0629 1.0608 1.0591 1.0612 1.0607 1.0629 1.0841 1.0764 1.0989 1.0875 1.0997 1.0890 1.1032 1.1030 1.0987 1.1025 1.1045 1.1005 1.1034 1.0921 1.0860 1.0878 1.0938 1.1006
irintensity: 0.2882 0.0980 0.2593 0.4449 2.0093 1.9325 1.1971 0.4812 1.0972 0.7300 0.2097 0.3794 0.1571 4.5552 4.6468 0.2585 1.4629 0.7704 4.2682 0.1251 3.8095 3.9080 0.1577 1.9523 13.3026 2.5118 3.9982 4.8286 0.7344 3.2952 5.3767 4.2952 5.5360 0.7107 17.9960 6.1958 1.9365 12.5752 0.9216 19.5601 17.9224 16.7290 26.9966 3.9893 9.3979 0.4188 10.6820 8.7182 9.9700 0.0479 1.9450 1.6404 3.4288 5.5031 37.6124 36.4431 2.9722 12.5916 0.6189 11.8996 0.9589 9.3336 56.1221 8.5947 25.2162 2.8821 4.6815 22.3125 22.9592 32.9201 129.4127 180.6637 16.5849 47.4462 1.1318 0.5782 1.6170 2.0284 2.0387 33.6082 40.3464 11.2238 1.2968 6.0158 5.9280 2.6971 4.3884 9.6519 1.0262 3.1026 2.6332 18.6041 13.5352 34.5225 27.3246 2.3573 2.3649 1.8031 5.9829 1.6049 3.3633 1.5539 2.5410 3.4575 5.4985 27.4581 8.1185 10.7127 14.6557 2.2017 12.6844 5.4587 11.9360 6.8929 14.7684 20.8776 0.2514 0.1221 121.9457 1.9385 111.4784 38.9662 45.9585 38.2769 13.0385 14.3831 31.7483 10.3451 44.5629 9.7904 52.2906 34.0475 70.1477 41.1898 9.6962 37.6020 6.8812 5.9197 14.6553 48.3976 34.1154 48.3985 31.3316 7.3425 3.2616 35.7882 31.3681
temp: 298.150 k
press: 1.00000 atm
elementType: 8 8 7 6 6 6 6 6 6 6 6 6 6 6 6 6 6 6 6 6 6 6 6 6 1 1 1 1 1 1 1 1 1 1 1 1 1 1 1 1 1 1 1 1 1 1 1 1 1 1 1
symmnumber: 1
zpe: 1143117.5 jmol-1
zpe.correction: 0.435390 hartree
zpe.thermalcorrener: 0.456170 hartree
zpe.thermalcorrenthalpy: 0.457114 hartree
zpe.thermalcorrgfe: 0.385329 hartree
zpe.sumelectzpe: -1019.823222 hartree
zpe.sumelectthermal: -1019.802443 hartree
zpe.sumelectthermalent: -1019.801499 hartree
zpe.sumelectthermalfe: -1019.873284 hartree
dipole: 1.5131 -0.1019 0.0921
dipole: 1.5194
quadrupole: -126.6642 -135.6832 -143.5592
quadrupole: 0.7797 0.1540 4.4667
quadrupole: 8.6380 -0.3810 -8.2570 0.7797 0.1540 4.4667
hfenergy: -1020.2586129 hartree
pointgroup: C01 [X(C21H27N1O2)]
dipole: 0.5970994 0.0189199 0.0208786 debye
polarizability: 244.7437713|22.78186|242.0525062|-20.6564316|5.3686076|198.9572548 unknown
InChI: InChI=1S/C21H27NO2/c1-22-17-10-11-18(22)14-19(13-17)24-21(23)12-16-8-3-2-6-15-7-4-5-9-20(15)16/h4-5,7-9,17-19H,2-3,6,10-14H2,1H3
charge 0 multiplicity 1
51 atoms
O  1.209763 -0.748917 -1.215137
O  0.091773 -1.65907 0.623394
N  4.643962 1.370709 -0.197766
C  4.907867 -0.047077 -0.610106
C  3.7239 1.16882 0.970842
C  5.169564 -0.823501 0.735158
C  4.371711 -0.000337 1.804203
C  3.640261 -0.563171 -1.341267
C  2.334231 0.778259 0.404964
C  2.441838 -0.547026 -0.377992
C  5.870415 2.133755 0.133018
C  0.103331 -1.317677 -0.5820
C  -1.050481 -1.483079 -1.571766
C  -2.407646 -1.232698 -0.928887
C  -2.689885 0.137329 -0.400048
C  -3.331859 -2.23406 -0.822751
C  -3.302228 0.300699 0.886701
C  -4.719874 -2.024162 -0.245974
C  -3.56035 -0.909398 1.772756
C  -4.726937 -1.82411 1.299254
C  -2.346642 1.292286 -1.153638
C  -3.587397 1.609707 1.347011
C  -2.638442 2.588939 -0.679987
C  -3.271097 2.749495 0.574013
H  5.771491 -0.086033 -1.296466
H  3.63779 2.104578 1.549866
H  6.248436 -0.840136 0.970545
H  4.832152 -1.873635 0.673678
H  3.605741 -0.606247 2.319712
H  5.047272 0.402461 2.579621
H  3.431989 0.105484 -2.195118
H  3.801565 -1.585818 -1.730675
H  1.592436 0.675366 1.217214
H  2.000582 1.578088 -0.280222
H  2.486933 -1.394199 0.331597
H  6.495277 1.689215 0.944745
H  5.586573 3.155288 0.442735
H  6.497989 2.21844 -0.772102
H  -0.860133 -0.814859 -2.430101
H  -1.008731 -2.519734 -1.95861
H  -3.069416 -3.237799 -1.185014
H  -2.635824 -1.518945 1.792295
H  -3.755811 -0.57945 2.810333
H  -4.637925 -2.799837 1.816014
H  -5.704227 -1.390012 1.589614
H  -5.157262 -1.114533 -0.703734
H  -5.379555 -2.869977 -0.512969
H  -1.864548 1.175141 -2.131076
H  -4.050238 1.734281 2.333815
H  -2.376831 3.465294 -1.283487
H  -3.503406 3.751963 0.951094
