program: Gaussian 09
title: 000218315
version: EM64L-G09RevD.01
frameworkgroup: C1[X(C12H15BrCl2N2O)]
method: RPBEPBE
basis: SDD
operation: Freq
keyword: #p
keyword: freq=noraman
keyword: PBEPBE/SDD
title: #p freq=noraman PBEPBE/SDD
converged: YES YES NO NO
title: Mulliken charges:
elementType: Br Cl Cl O N N C C C C C C C C C C C C H H H H H H H H H H H H H H H
charge: 0.032004 -0.076694 -0.069391 -0.298772 -0.080798 -0.374224 -0.407284 -0.312854 -0.316158 -0.588370 -0.565469 0.207104 0.279868 -0.340866 -0.331099 -0.181037 -0.194202 -0.205341 0.234569 0.253864 0.222896 0.235380 0.218256 0.238549 0.301203 0.245353 0.333336 0.258752 0.268623 0.283879 0.214566 0.258619 0.255740
chargesum: 0.00000
title: Mulliken charges with hydrogens summed into heavy atoms:
elementType: Br Cl Cl O N N C C C C C C C C C C C C
charge: 0.032004 -0.076694 -0.069391 -0.298772 -0.080798 -0.073021 0.081148 0.145422 0.140647 -0.009681 -0.038094 0.207104 0.279868 -0.056987 -0.116533 0.077582 0.061538 -0.205341
polarizability: 2.58028247e+02 1.69746019e+01 1.86087813e+02 -2.14495283e+01 1.66277428e+01 1.23729081e+02
1716.lowfreq: -3.8789 -2.0294 -0.0012 0.0007 0.0008 4.5900 11.9231 16.6106 25.4957
frequency: 11.6936 16.5979 25.4850 41.8279 47.8218 61.4013 75.5942 85.8634 87.3724 117.0392 130.0571 193.4950 199.6834 209.6867 217.8190 257.6022 267.1052 310.8237 321.2683 369.1130 403.2576 444.1898 454.0645 455.1049 488.6107 541.5984 569.3134 622.0505 661.4965 663.8562 680.1642 686.4437 742.4167 768.1037 782.0227 787.9141 824.5794 840.9917 857.0810 940.9809 954.4777 992.3490 994.5881 995.5534 1010.1646 1015.7692 1039.4640 1050.6560 1061.6302 1098.7487 1111.1422 1120.9141 1127.4444 1190.8972 1222.7161 1239.4952 1250.4832 1259.8076 1272.2016 1290.1214 1296.2858 1334.3076 1344.9242 1364.0055 1368.7687 1375.7771 1388.8087 1394.2625 1429.9097 1446.0085 1455.4497 1460.1197 1461.3070 1469.2347 1492.2640 1558.0847 1592.9437 1598.1137 2970.9861 2973.0774 2986.2926 3035.0189 3047.3442 3051.2007 3057.9557 3080.1849 3126.9014 3143.7507 3147.6227 3157.5913 3172.3856 3177.4423 3551.9436
redmass: 9.6859 10.6755 5.0480 10.4515 5.9878 3.8202 5.6577 3.2890 3.5669 3.8503 4.6175 7.2958 4.5740 5.7913 7.0105 6.6454 5.7721 4.0215 4.8344 5.4917 2.7929 2.9178 2.3103 3.8645 4.4225 1.4474 2.9325 6.9485 5.8174 6.2638 4.8565 5.5263 3.3663 1.1998 1.4109 2.1945 1.4326 4.3247 1.5047 4.1166 1.4505 1.6833 1.4608 2.9549 1.6576 3.4772 3.4839 3.1491 2.7769 1.8728 1.4881 2.1097 1.3065 1.1345 1.7902 1.3124 1.2930 1.5719 1.8283 1.1250 1.2780 1.4067 1.3075 4.4095 1.2716 1.4160 2.4263 1.4836 1.1497 1.0977 1.1202 1.0949 1.7701 1.1017 2.0563 7.3313 6.0504 7.2665 1.0605 1.0643 1.0599 1.1041 1.0808 1.0790 1.0565 1.0974 1.0894 1.1125 1.1126 1.0888 1.0951 1.0972 1.0777
irintensity: 0.3319 0.2914 0.2180 0.7316 2.5664 1.5432 3.1564 3.0602 0.2379 4.1281 6.8300 7.1032 2.8535 2.3846 3.9846 5.9528 3.3934 7.5194 3.5837 28.0990 0.9698 1.3492 6.3714 17.8918 12.0932 90.7829 59.4186 2.2986 98.1184 53.4127 6.1533 25.7372 22.3115 2.8084 24.1082 13.4867 19.0098 27.2148 27.7631 13.8191 2.2578 38.7080 9.5958 56.4897 49.2636 24.5745 3.7019 21.8270 23.7646 195.1977 24.7180 12.6629 27.2940 15.9910 25.2506 16.3230 49.4873 104.3778 67.0538 29.9709 8.5311 60.3166 4.8093 1.0777 7.8610 12.1116 4.1199 11.7016 24.1774 25.6265 5.7385 7.0808 189.6736 23.3682 146.7208 67.4415 130.6352 68.5956 14.9836 82.6448 42.4589 17.3894 6.1363 36.9413 22.3903 4.8211 15.3347 27.1250 8.2892 0.3210 4.7991 1.9750 8.6988
temp: 298.150 k
press: 1.00000 atm
elementType: 35 17 17 8 7 7 6 6 6 6 6 6 6 6 6 6 6 6 1 1 1 1 1 1 1 1 1 1 1 1 1 1 1
symmnumber: 1
zpe: 664349.0 jmol-1
zpe.correction: 0.253037 hartree
zpe.thermalcorrener: 0.272638 hartree
zpe.thermalcorrenthalpy: 0.273582 hartree
zpe.thermalcorrgfe: 0.198537 hartree
zpe.sumelectzpe: -1583.228238 hartree
zpe.sumelectthermal: -1583.208638 hartree
zpe.sumelectthermalent: -1583.207694 hartree
zpe.sumelectthermalfe: -1583.282738 hartree
dipole: 1.1731 2.7856 2.9593
dipole: 4.2301
quadrupole: -141.7501 -148.1352 -128.3801
quadrupole: -4.6229 -9.5743 8.1524
quadrupole: -2.3283 -8.7134 11.0417 -4.6229 -9.5743 8.1524
hfenergy: -1583.4812754 hartree
pointgroup: C01 [X(C12H15Br1Cl2N2O1)]
dipole: -0.2494512 1.6220615 0.2764048 debye
polarizability: 242.2843551|6.7858723|160.1797872|-45.1486781|36.6502945|165.3809976 unknown
InChI: InChI=1S/C12H15BrCl2N2O/c13-11-3-1-10(2-4-11)12(18)16-9-17(7-5-14)8-6-15/h1-4,16H,5-9H2
charge 0 multiplicity 1
33 atoms
Br -5.890645 -0.030562 2.331164
Cl 3.358536 -3.523673 -2.083928
Cl 3.984877 0.755929 3.32594
O  -0.24462 -0.680397 -1.737368
N  2.92287 0.382695 -0.688002
N  0.524518 1.090262 -0.449628
C  1.821569 1.196517 -1.175338
C  3.380227 -0.794995 -1.442344
C  3.623862 0.790246 0.532264
C  2.60153 -2.083436 -1.106149
C  3.107607 0.062076 1.792463
C  -0.443929 0.16147 -0.801584
C  -1.734392 0.17661 -0.022624
C  -2.577521 -0.957022 -0.146592
C  -2.153624 1.257226 0.796593
C  -3.803425 -1.02944 0.544754
C  -3.380089 1.202491 1.493316
C  -4.189125 0.053946 1.363174
H  2.100607 2.269032 -1.135295
H  1.615359 0.913304 -2.221143
H  4.455265 -0.954346 -1.232032
H  3.287499 -0.606152 -2.529048
H  3.496997 1.881619 0.679314
H  4.710563 0.601312 0.433714
H  0.370424 1.702504 0.352614
H  2.691804 -2.371046 -0.047567
H  1.549838 -2.021491 -1.419724
H  2.032493 0.222918 1.961551
H  3.340689 -1.012975 1.785947
H  -2.253431 -1.772919 -0.800368
H  -1.55772 2.173505 0.883811
H  -4.445437 -1.909194 0.447591
H  -3.702077 2.040185 2.117923
