program: Gaussian 09
title: 000218309
version: EM64L-G09RevD.01
frameworkgroup: C1[X(C22H28N2O2S)]
method: RPBEPBE
basis: SDD
operation: Freq
keyword: #p
keyword: freq=noraman
keyword: PBEPBE/SDD
title: #p freq=noraman PBEPBE/SDD
converged: YES YES NO NO
title: Mulliken charges:
elementType: S O O N N C C C C C C C C C C C C C C C C C C C C C C H H H H H H H H H H H H H H H H H H H H H H H H H H H H
charge: 0.210610 -0.305171 -0.444253 -0.061757 -0.234091 0.050366 -0.429548 -0.463482 -0.379409 -0.371776 -0.334847 -0.418082 -0.510049 -0.320817 0.496474 0.501642 -0.344855 -0.346064 -0.291579 -0.323652 -0.320498 -0.273209 -0.272925 -0.266413 -0.262473 -0.252520 -0.251710 0.177278 0.190198 0.225727 0.226042 0.205964 0.170949 0.217683 0.224566 0.170413 0.174686 0.209311 0.240741 0.236337 0.240684 0.245223 0.183054 0.244638 0.216249 0.183236 0.240710 0.239975 0.244313 0.243943 0.226115 0.227243 0.232586 0.232449 0.349776
chargesum: 0.00000
title: Mulliken charges with hydrogens summed into heavy atoms:
elementType: S O O N N C C C C C C C C C C C C C C C C C C C C C C
charge: 0.210610 -0.305171 -0.094478 -0.061757 -0.234091 0.227644 -0.013623 -0.031475 0.009223 0.023204 0.049150 0.058996 -0.024143 0.106874 0.496474 0.501642 -0.344855 -0.346064 0.107906 -0.082942 -0.080523 -0.028896 -0.028982 -0.040298 -0.035230 -0.019934 -0.019261
polarizability: 3.30421013e+02 -5.88068682e+00 3.35783929e+02 -2.69088677e+01 7.24741479e+00 1.78167801e+02
1716.lowfreq: -6.0457 -0.0013 -0.0010 0.0017 3.5979 7.6492 12.8308 13.6729 22.1995
frequency: 11.1295 13.4711 22.0947 30.0205 38.0546 45.0054 60.0568 86.0949 100.5553 101.3860 123.1408 152.7919 170.4837 182.3322 203.8865 223.6723 234.7016 237.8791 247.8147 265.4020 320.1929 328.1014 334.3506 353.2033 365.2589 373.9817 408.4228 416.5772 434.2110 436.6377 447.3489 457.9974 465.2081 483.8279 493.2853 499.9439 516.9778 530.7956 553.8752 583.7551 600.2453 627.4261 659.0763 676.6788 715.8717 719.3557 742.8886 746.6577 749.1330 765.1847 772.4694 808.4151 813.6658 834.6814 839.1331 843.2729 850.2125 859.7941 902.7735 922.5971 924.6887 935.0329 945.2350 966.5036 967.9868 982.0421 989.1120 999.6297 1016.7776 1024.9744 1036.8211 1038.1745 1043.6694 1045.1509 1051.9526 1067.1364 1092.6990 1096.4846 1099.8786 1117.4400 1123.9754 1130.3421 1137.4775 1141.6955 1144.5143 1169.3719 1174.8269 1177.2743 1179.1636 1202.9812 1228.3104 1238.4287 1247.8693 1250.4093 1258.7142 1275.2025 1281.9204 1288.1771 1291.4015 1295.9666 1305.5538 1315.7968 1320.1400 1332.2162 1345.3106 1353.0434 1355.9100 1359.3716 1367.9670 1375.3549 1379.1981 1381.2546 1384.2083 1397.9967 1426.9780 1431.5054 1442.7040 1451.7964 1462.0440 1464.6781 1466.8656 1468.8495 1471.2965 1480.0526 1482.5503 1494.2459 1505.8811 1565.5064 1584.3037 1586.0600 1612.4262 2809.0891 2813.1056 2830.0576 2920.5930 2943.1178 2979.8045 2993.8481 2996.4545 2997.1435 3006.7304 3019.6974 3028.2041 3044.0075 3053.1204 3060.1248 3064.7802 3073.3229 3077.0634 3078.5066 3132.9138 3133.5014 3141.4427 3142.1711 3164.9946 3165.9661 3179.1031 3183.7963 3506.0270
redmass: 3.4414 5.5587 4.7555 4.9055 4.6105 5.8970 5.3086 3.8602 3.5637 3.3217 4.7793 3.1129 4.6131 4.1093 2.5804 2.1713 4.0410 2.7230 3.8799 4.7618 4.4889 3.8411 3.0323 2.9550 3.1424 3.3571 4.8392 3.2649 3.5202 4.8914 3.1145 2.5144 3.2962 4.3033 1.1735 3.2693 2.4888 3.9113 3.8425 2.7842 5.5932 4.3370 6.0044 5.9428 3.2384 3.0481 3.3598 1.3428 1.5597 1.1933 3.6951 2.0995 1.5667 1.8561 1.4734 1.3944 2.6757 2.5558 2.0111 1.3742 1.3779 1.7369 2.2946 1.3121 1.3131 1.6353 2.8942 4.0412 3.0960 7.1558 2.4704 4.4667 3.2399 3.9539 2.0607 2.9505 2.1694 2.0631 2.7538 2.6083 1.9061 1.7569 1.4884 1.9847 1.6039 1.2894 1.5816 1.0883 1.0873 1.4042 1.2013 1.4261 2.5439 1.4940 1.3525 1.3438 1.3183 1.5857 1.3864 1.1575 1.2534 1.3382 1.2118 1.3095 1.2778 1.5255 2.2832 1.4719 1.4136 2.7514 1.6045 1.3259 4.5181 1.4208 2.3919 2.3272 1.0913 1.0897 1.0842 2.6271 1.0960 1.0901 1.0840 1.3548 1.6530 1.1305 1.0959 5.9451 6.6718 6.6058 7.0724 1.0710 1.0720 1.0697 1.0825 1.0695 1.0635 1.0661 1.0700 1.0709 1.0604 1.0606 1.0863 1.1011 1.0870 1.0934 1.1021 1.1029 1.1012 1.1032 1.0854 1.0855 1.0910 1.0911 1.0959 1.0970 1.0963 1.0947 1.0651
irintensity: 0.5643 0.2935 0.8141 1.0123 0.2405 1.4124 1.8171 0.3349 0.4223 1.5931 2.3321 4.4317 4.1010 0.5693 0.1416 1.1828 0.3296 2.3574 1.9590 2.1947 2.5927 1.7642 2.2709 3.8638 1.2673 1.8347 0.7328 11.0080 0.6574 0.7951 0.6928 4.3878 8.5686 14.7288 118.0902 3.9284 7.8513 0.0069 1.2798 6.0913 0.6440 8.1522 2.3579 5.7260 1.0778 13.1258 24.1258 34.2452 121.7989 18.8117 2.4225 10.7375 0.8655 7.1361 2.2536 0.9261 15.4234 10.5565 0.8540 2.1044 1.6571 11.3184 2.1272 0.0377 0.0226 10.1185 40.1301 113.0338 61.7972 32.4734 2.7637 0.3263 1.6858 91.0524 22.4392 1.9214 16.1467 47.0565 8.5940 9.4354 12.3970 19.9006 7.7884 26.2568 2.5564 29.2386 21.8701 2.5096 0.0359 30.6774 21.0960 21.5356 63.0552 20.4983 4.6235 2.8678 17.5909 7.2090 19.9431 19.3930 2.0556 2.5650 12.4313 31.3477 10.6496 20.1681 95.9789 24.2149 16.4968 4.2281 14.4683 24.3435 17.4586 5.8327 19.3126 17.8101 4.0640 13.0898 5.3451 329.6100 14.2045 11.7347 2.6338 13.7292 19.4718 8.5602 21.8932 2.1018 0.8901 33.6398 44.0458 43.3460 41.6738 200.2664 28.2444 79.7529 40.3313 10.4349 56.2670 16.6442 27.8525 19.3216 54.6932 4.0924 38.9909 35.5546 26.3234 41.5369 44.6611 35.0954 1.0186 0.1947 10.2338 10.8816 32.0075 27.7688 15.5734 14.1711 10.2894
temp: 298.150 k
press: 1.00000 atm
elementType: 16 8 8 7 7 6 6 6 6 6 6 6 6 6 6 6 6 6 6 6 6 6 6 6 6 6 6 1 1 1 1 1 1 1 1 1 1 1 1 1 1 1 1 1 1 1 1 1 1 1 1 1 1 1 1
symmnumber: 1
zpe: 1204595.4 jmol-1
zpe.correction: 0.458806 hartree
zpe.thermalcorrener: 0.484195 hartree
zpe.thermalcorrenthalpy: 0.485139 hartree
zpe.thermalcorrgfe: 0.399452 hartree
zpe.sumelectzpe: -1511.093480 hartree
zpe.sumelectthermal: -1511.068092 hartree
zpe.sumelectthermalent: -1511.067148 hartree
zpe.sumelectthermalfe: -1511.152834 hartree
dipole: -0.9271 -0.3942 3.5184
dipole: 3.6598
quadrupole: -197.8735 -160.4680 -173.2922
quadrupole: 5.8188 -28.6244 1.4182
quadrupole: -20.6623 16.7433 3.9190 5.8188 -28.6244 1.4182
hfenergy: -1511.5522863 hartree
pointgroup: C01 [X(C22H28N2O2S1)]
dipole: 0.354209 0.0214264 1.3954722 debye
polarizability: 330.0633224|-8.5315021|335.6591203|27.3348749|8.0719202|178.6502993 unknown
InChI: InChI=1S/C22H28N2O2S/c25-16-17-26-18-10-14-23(15-11-18)12-5-13-24-19-6-1-3-8-21(19)27-22-9-4-2-7-20(22)24/h1-4,6-9,18,25H,5,10-17H2
charge 0 multiplicity 1
55 atoms
S  -5.702912 -0.277589 -0.21224
O  6.320253 0.736203 -0.670811
O  8.320191 -0.936921 -1.835745
N  2.366284 0.478157 0.915206
N  -2.698359 0.019577 0.635463
C  5.182742 0.190624 0.106278
C  4.747988 1.155583 1.227179
C  4.029434 -0.012775 -0.8855
C  3.461315 0.638986 1.905781
C  2.752638 -0.477209 -0.154555
C  1.08273 0.126472 1.569254
C  -0.134959 0.252846 0.6294
C  -1.458205 0.138767 1.436278
C  7.642776 0.587708 -0.024601
C  -3.074801 -1.2768 0.167824
C  -3.322751 1.218051 0.169229
C  -4.382613 -1.54148 -0.334321
C  -4.659286 1.223697 -0.325495
C  8.239398 -0.782083 -0.381604
C  -2.160732 -2.369778 0.19925
C  -2.637193 2.466069 0.196739
C  -4.737526 -2.811399 -0.828889
C  -5.258878 2.402512 -0.809823
C  -2.531944 -3.65414 -0.254809
C  -3.254306 3.655764 -0.246608
C  -3.817273 -3.883497 -0.786367
C  -4.565117 3.633197 -0.765125
H  5.469183 -0.790438 0.551246
H  5.54412 1.269485 1.987918
H  4.555243 2.147372 0.779168
H  3.834013 0.947799 -1.395995
H  4.315405 -0.756485 -1.652033
H  3.681777 -0.33003 2.430585
H  3.131773 1.359379 2.677235
H  1.929396 -0.553507 -0.885025
H  2.917315 -1.505346 0.26898
H  1.109262 -0.909807 2.00408
H  0.946937 0.8228 2.421285
H  -0.113529 -0.52807 -0.150768
H  -0.071072 1.221691 0.103454
H  -1.406764 -0.743883 2.101476
H  -1.565158 1.018198 2.09769
H  7.579619 0.732553 1.073305
H  8.259419 1.391433 -0.46247
H  9.273465 -0.867015 -0.00387
H  7.631997 -1.598235 0.068419
H  -1.14665 -2.228811 0.578707
H  -1.609259 2.519919 0.559875
H  -5.747203 -2.964219 -1.225403
H  -6.281429 2.357446 -1.200244
H  -1.802301 -4.469531 -0.202005
H  -2.695206 4.596407 -0.197245
H  -4.10621 -4.872443 -1.15538
H  -5.044444 4.548902 -1.124918
H  7.46941 -0.573405 -2.201256
