program: Gaussian 09
title: 000218302
version: EM64L-G09RevD.01
frameworkgroup: C1[X(C17H16O)]
method: RPBEPBE
basis: SDD
operation: Freq
keyword: #pfreq=noraman
keyword: PBEPBE/SDD
title: #p freq=noraman PBEPBE/SDD
converged: YES YES NO NO
title: Mulliken charges:
elementType: O C C C C C C C C C C C C C C C C C H H H H H H H H H H H H H H H H
charge: -0.440759 -0.241865 0.493610 0.208880 0.420474 -0.622435 0.215166 -0.492073 -0.384291 0.418389 -0.325072 -0.722819 -0.494668 -0.476808 -0.373974 -0.431754 -0.256948 -0.249468 0.226319 0.240023 0.258353 0.225234 0.215633 0.184196 0.221334 0.204819 0.234191 0.238191 0.235734 0.224285 0.239867 0.228237 0.229798 0.350200
chargesum: 0.00000
title: Mulliken charges with hydrogens summed into heavy atoms:
elementType: O C C C C C C C C C C C C C C C C C
charge: -0.090559 -0.015546 0.493610 0.208880 0.420474 -0.382412 0.215166 -0.233721 -0.159057 0.418389 0.074757 -0.062474 -0.256477 -0.241074 -0.149689 -0.191888 -0.028711 -0.019671
polarizability: 3.18990597e+02 -8.14488412e+00 1.85521751e+02 1.25840678e+01 1.44056316e+01 9.60568614e+01
1716.lowfreq: -11.9062 -0.0007 0.0004 0.0005 0.9234 6.4844 15.9989 46.1584 96.5317
frequency: 14.6641 46.1340 96.5188 102.8884 136.8034 144.1422 195.7372 208.2055 229.2624 232.3913 271.7815 349.3783 371.7334 387.0160 395.3670 416.1518 440.6664 459.8623 486.2764 500.2337 537.4110 548.1672 549.7698 575.3978 653.8730 659.6585 713.1372 733.5403 758.3057 758.6984 799.5324 831.1740 843.6480 852.6393 869.6776 888.1486 909.0038 919.2659 924.5486 956.0793 969.5083 983.4571 988.6044 991.6284 992.9044 1039.3493 1041.1439 1080.1810 1098.6701 1111.2754 1152.7501 1162.5627 1166.2675 1177.6159 1188.8841 1231.2332 1238.9892 1260.6077 1277.0061 1281.9565 1308.6817 1323.0543 1333.0216 1368.5680 1389.3457 1394.8930 1398.7935 1404.5708 1425.3809 1449.3117 1461.5957 1465.9816 1475.3752 1484.6632 1495.6813 1531.0655 1575.4282 1608.0716 1625.9743 1629.9928 2944.0462 2981.2147 2997.0019 3066.5965 3073.3998 3087.1371 3117.6013 3122.0238 3124.3133 3125.6602 3133.1855 3143.0875 3147.7461 3156.1963 3165.7969 3535.1375
redmass: 4.3849 5.3906 4.5743 3.6507 3.3218 2.7767 3.7509 1.2476 3.7086 2.4706 3.6340 3.5005 2.0219 1.9387 2.7689 3.4296 3.6901 3.5121 4.9038 4.4454 3.0411 3.0037 6.9693 3.6927 3.1548 4.9709 5.9805 2.9788 4.1860 1.3446 1.8505 1.4616 1.6131 4.1862 2.4221 1.9445 1.7580 1.9999 1.4283 1.4096 1.3781 1.3820 5.4490 6.5741 1.3756 2.2045 1.9983 2.3427 2.0453 1.9796 1.3569 1.2495 1.4916 1.0936 1.3699 2.1160 1.7950 1.4993 1.3198 1.5998 2.1782 1.2015 1.9551 1.2838 2.0330 1.3506 3.6307 3.6672 2.5642 3.6108 1.5233 1.4067 1.1239 1.0648 3.2937 3.8234 7.5188 5.8137 6.5139 6.7081 1.0681 1.0362 1.0833 1.0973 1.0976 1.0999 1.0863 1.0863 1.0900 1.0880 1.0885 1.0982 1.0952 1.0945 1.0992 1.0656
irintensity: 1.0231 0.2049 2.1721 0.2753 0.3200 1.1280 0.3306 0.2575 6.2718 0.3458 1.2552 9.3857 72.9254 88.5532 14.7110 9.6243 0.6267 17.3024 3.3525 2.6312 0.5276 0.2101 0.1817 3.3245 3.8304 5.1231 0.0611 16.9922 7.8929 49.1703 1.3275 47.7137 14.2362 4.3997 8.8952 4.9523 10.5249 24.6619 13.1440 3.3080 5.8017 0.3103 67.6487 19.9166 0.2935 14.6582 8.5461 5.0615 2.6596 2.7644 3.8461 18.4920 0.9799 0.6794 4.6439 3.2583 6.6964 16.0608 4.6704 0.2685 1.3948 7.5958 8.0889 23.1787 4.7944 18.1820 1.1476 0.5298 7.0689 1.8891 4.8162 7.1353 17.5935 14.6829 12.2730 1.6016 0.2454 4.1956 4.0186 7.5761 47.1301 33.8139 21.7855 5.2719 98.8218 33.1091 0.2891 4.7879 10.2890 11.3741 6.5848 30.6888 13.2737 27.8553 36.6595 5.0380
temp: 298.150 k
press: 1.00000 atm
elementType: 8 6 6 6 6 6 6 6 6 6 6 6 6 6 6 6 6 6 1 1 1 1 1 1 1 1 1 1 1 1 1 1 1 1
symmnumber: 1
zpe: 731343.5 jmol-1
zpe.correction: 0.278554 hartree
zpe.thermalcorrener: 0.293765 hartree
zpe.thermalcorrenthalpy: 0.294709 hartree
zpe.thermalcorrgfe: 0.235338 hartree
zpe.sumelectzpe: -731.390344 hartree
zpe.sumelectthermal: -731.375132 hartree
zpe.sumelectthermalent: -731.374188 hartree
zpe.sumelectthermalfe: -731.433559 hartree
dipole: 1.1791 1.4273 -0.9481
dipole: 2.0799
quadrupole: -99.3210 -97.7866 -113.9158
quadrupole: -8.7830 7.8821 6.4993
quadrupole: 4.3535 5.8879 -10.2413 -8.7830 7.8821 6.4993
hfenergy: -731.6688975 hartree
pointgroup: C01 [X(C17H16O1)]
dipole: -0.46552 0.441783 0.5076848 debye
polarizability: 318.6741523|2.7931095|186.2747488|17.2458046|11.3908488|95.6203084 unknown
InChI: InChI=1S/C17H16O/c1-12(11-18)14-8-9-17-15(10-14)7-6-13-4-2-3-5-16(13)17/h2-10,12,18H,11H2,1H3
charge 0 multiplicity 1
34 atoms
O  4.119173 -1.08352 -1.864763
C  3.901214 -0.239748 0.506352
C  2.373863 -0.248934 0.427612
C  -0.501974 -0.354892 0.13183
C  0.185153 0.903458 0.296589
C  1.60598 0.927525 0.438834
C  -1.960808 -0.364505 -0.013783
C  1.684316 -1.492277 0.263307
C  0.290695 -1.542083 0.122818
C  -2.67615 0.888754 0.009454
C  4.507097 -0.037078 -0.915442
C  4.47848 0.818604 1.474142
C  -0.574134 2.135164 0.315499
C  -1.947956 2.127544 0.176778
C  -2.717035 -1.565592 -0.180785
C  -4.098276 0.896331 -0.133229
C  -4.11192 -1.536569 -0.318921
C  -4.812434 -0.296471 -0.295582
H  4.228213 -1.242102 0.847235
H  2.093323 1.901934 0.565155
H  2.263131 -2.423428 0.268911
H  -0.187571 -2.519556 0.006602
H  5.60749 -0.100392 -0.866056
H  4.224708 0.97074 -1.292506
H  5.575384 0.708738 1.557624
H  4.27635 1.848789 1.12545
H  4.044364 0.712006 2.483675
H  -0.032267 3.079859 0.442783
H  -2.51485 3.065995 0.191361
H  -2.208106 -2.534196 -0.203084
H  -4.624671 1.858177 -0.11336
H  -4.666549 -2.472786 -0.445727
H  -5.902255 -0.280524 -0.404091
H  3.129522 -1.094965 -1.936082
