program: Gaussian 09
title: 000218296
version: EM64L-G09RevD.01
frameworkgroup: C1[X(C12H16N2)]
method: RPBEPBE
basis: SDD
operation: Freq
keyword: #pfreq=noraman
keyword: PBEPBE/SDD
title: #p freq=noraman PBEPBE/SDD
converged: YES YES NO NO
title: Mulliken charges:
elementType: N N C C C C C C C C C C C C H H H H H H H H H H H H H H H H
charge: -0.048015 -0.400273 -0.201823 -0.167643 -0.417939 -0.421199 0.286444 -0.368941 0.223682 -0.433055 -0.615714 -0.398695 -0.271229 -0.212327 0.232385 0.233505 0.188791 0.234912 0.179404 0.214181 0.211057 0.169049 0.265380 0.222799 0.224961 0.183698 0.224976 0.225507 0.218774 0.217347
chargesum: 0.00000
title: Mulliken charges with hydrogens summed into heavy atoms:
elementType: N N C C C C C C C C C C C C
charge: -0.048015 -0.134893 0.030562 0.065862 0.005764 -0.027613 0.286444 0.011165 0.223682 -0.210256 0.017920 -0.173187 -0.052455 0.005020
polarizability: 1.65121709e+02 8.37061486e+00 1.45745117e+02 1.56163557e+01 -1.36857281e+00 9.65693134e+01
1716.lowfreq: -11.5759 -7.8791 -0.0006 -0.0003 -0.0002 12.4207 69.5713 83.5290 136.3212
frequency: 69.5352 83.4208 136.3168 204.4995 214.2083 238.3958 268.2766 323.6856 343.8838 359.0992 378.8073 419.5649 453.1146 488.9356 527.3446 536.1156 562.1993 586.8334 682.6135 704.2693 716.2710 746.3360 753.4907 775.7401 827.1987 844.6855 853.9068 915.8253 929.4778 954.8151 961.5886 1002.1468 1016.5983 1025.8750 1039.5552 1060.7335 1074.9807 1084.2047 1113.3573 1128.8088 1136.0289 1150.7031 1167.1894 1189.2492 1203.8412 1229.9046 1252.6919 1260.5624 1278.5738 1292.6477 1302.4687 1314.7763 1329.3428 1347.9965 1352.2505 1371.0490 1380.6917 1421.4599 1432.5102 1447.1287 1455.5988 1463.0325 1463.8764 1480.8809 1481.4984 1482.3035 1603.1083 1625.6001 2802.4128 2812.3641 2850.2049 2941.0682 2987.7518 3013.1292 3017.1661 3017.8752 3029.9724 3058.5879 3076.9615 3117.7606 3124.1795 3140.0412 3160.1728 3530.9323
redmass: 3.7597 3.1965 3.5675 1.7053 2.5868 1.4524 3.6062 2.3823 3.7819 2.0718 2.2679 2.9725 3.6406 1.6832 3.3900 3.2698 4.0929 4.0467 3.1093 3.7021 4.0635 1.3847 3.7849 2.5065 2.4328 1.4644 3.6481 1.5751 1.7502 2.1571 1.3275 2.1383 2.4485 2.2388 2.2367 1.8838 2.0368 2.2055 1.3247 1.8707 1.8724 1.6507 1.0760 1.9575 1.3668 1.2983 1.7544 1.8229 1.6500 1.5131 1.5260 1.3235 1.8553 1.4513 1.4070 2.0207 1.4038 2.6757 1.1767 1.0994 2.5957 1.0653 1.0714 1.1474 2.5498 1.1279 6.6113 7.3853 1.0721 1.0694 1.0579 1.0820 1.0610 1.0856 1.0873 1.0720 1.0873 1.1018 1.1009 1.0853 1.0892 1.0940 1.0999 1.0773
irintensity: 1.0391 0.3181 0.2471 0.7767 3.8953 0.6983 2.5982 2.9758 1.1299 5.1550 6.1745 5.0577 0.9760 123.6778 34.4532 1.6320 23.3339 28.7000 13.3738 12.4253 1.2416 75.2213 19.1292 3.3366 3.9213 2.9332 3.9796 1.1949 3.7155 9.5368 0.2699 13.9107 2.3558 8.9637 20.6591 16.1060 13.3600 10.8921 2.5607 4.0310 18.7001 14.4492 1.2496 13.3511 11.3336 3.9939 37.2352 5.0506 8.9683 13.6734 4.0299 10.9536 0.3738 7.2773 1.3895 25.7922 16.1905 2.2388 2.8400 9.4456 39.0755 6.5335 17.7355 33.4659 50.3178 15.3684 1.2685 62.5176 52.8986 126.0805 228.8715 37.3093 32.8454 32.9873 31.3286 51.1861 39.6950 54.5565 33.5936 5.9926 9.5993 37.0400 31.1161 8.0235
temp: 298.150 k
press: 1.00000 atm
elementType: 7 7 6 6 6 6 6 6 6 6 6 6 6 6 1 1 1 1 1 1 1 1 1 1 1 1 1 1 1 1
symmnumber: 1
zpe: 675915.6 jmol-1
zpe.correction: 0.257443 hartree
zpe.thermalcorrener: 0.269088 hartree
zpe.thermalcorrenthalpy: 0.270033 hartree
zpe.thermalcorrgfe: 0.220350 hartree
zpe.sumelectzpe: -575.321784 hartree
zpe.sumelectthermal: -575.310138 hartree
zpe.sumelectthermalent: -575.309194 hartree
zpe.sumelectthermalfe: -575.358877 hartree
dipole: 2.2434 1.2789 0.0040
dipole: 2.5824
quadrupole: -80.3252 -75.6978 -86.5484
quadrupole: -1.2279 3.5906 -3.4821
quadrupole: 0.5319 5.1593 -5.6912 -1.2279 3.5906 -3.4821
hfenergy: -575.5792265 hartree
pointgroup: C01 [X(C12H16N2)]
dipole: 0.9019287 0.4675712 0.0107052 debye
polarizability: 165.5350543|7.4915107|145.1315684|16.0785015|-1.6468348|96.7695169 unknown
InChI: InChI=1S/C12H16N2/c1-14-7-6-12-10(8-14)9-4-2-3-5-11(9)13-12/h2-5,10,12-13H,6-8H2,1H3
charge 0 multiplicity 1
30 atoms
N  2.373467 -0.754223 -0.366911
N  -0.682129 1.987203 0.391507
C  0.517288 0.07222 1.125724
C  0.727243 1.526472 0.582805
C  1.517629 1.529631 -0.753855
C  1.748019 -0.841708 0.969208
C  -0.793055 -0.331922 0.449591
C  2.770355 0.636888 -0.678414
C  -1.481054 0.86166 0.082749
C  -1.394038 -1.581772 0.256053
C  3.482223 -1.713986 -0.519312
C  -2.777082 0.815716 -0.473491
C  -2.695596 -1.646802 -0.313955
C  -3.37397 -0.456372 -0.666276
H  0.310996 0.151969 2.215965
H  1.241431 2.158411 1.330168
H  1.802582 2.566126 -1.021599
H  0.862439 1.133708 -1.5519
H  2.488581 -0.573012 1.772074
H  1.449965 -1.891983 1.152233
H  3.294731 0.644903 -1.651911
H  3.486991 1.042591 0.087477
H  -0.844221 2.872527 -0.09392
H  -0.867779 -2.503904 0.531082
H  3.10933 -2.741504 -0.358021
H  4.326219 -1.53775 0.196965
H  3.887764 -1.655279 -1.545172
H  -3.311306 1.730748 -0.753643
H  -3.173826 -2.618027 -0.480258
H  -4.378402 -0.514826 -1.102067
