program: Gaussian 09
title: 000218284
version: EM64L-G09RevD.01
frameworkgroup: C1[X(C16H21N2O2)]
method: RPBEPBE
basis: SDD
operation: Freq
keyword: #p
keyword: freq=noraman
keyword: PBEPBE/SDD
title: #p freq=noraman PBEPBE/SDD
converged: YES YES NO NO
title: Mulliken charges:
elementType: O O N N C C C C C C C C C C C C C C C C H H H H H H H H H H H H H H H H H H H H H
charge: -0.296976 -0.238032 -0.101547 -0.458357 -0.456371 -0.373126 0.109654 -0.513669 0.176186 -0.572405 -0.559500 0.179436 0.218925 -0.524549 -0.344444 0.254925 -0.338860 0.145498 -0.257118 -0.659927 0.276097 0.272371 0.273603 0.290919 0.265466 0.273583 0.263690 0.298259 0.265913 0.271872 0.269853 0.268948 0.329529 0.276648 0.254348 0.286446 0.223887 0.243629 0.230845 0.253995 0.220355
chargesum: 1.00000
title: Mulliken charges with hydrogens summed into heavy atoms:
elementType: O O N N C C C C C C C C C C C C C C C C
charge: -0.296976 -0.238032 -0.101547 -0.128828 0.092097 0.191395 0.109654 0.025381 0.176186 0.255457 0.251173 0.179436 0.218925 -0.247901 -0.090096 0.254925 -0.052414 0.145498 0.210399 0.045268
polarizability: 2.80177129e+02 -3.35188394e+00 1.97096230e+02 6.63909271e-01 7.57430354e+00 1.12796399e+02
1716.lowfreq: -2.7202 -2.6326 -0.0007 -0.0004 0.0003 7.8283 33.7455 40.8584 57.1508
frequency: 33.7361 40.8453 57.1308 76.9422 88.5209 95.3050 157.9577 167.4942 175.9775 210.6483 220.3917 239.1682 265.6009 269.7478 288.5737 307.0054 321.9360 326.2797 334.6269 387.2107 398.0454 414.1632 429.7339 444.6165 465.1353 505.1805 532.4205 559.3957 571.0025 577.3111 630.2677 657.4631 666.0459 716.8603 722.2949 744.7855 769.0560 791.6421 818.0281 824.9883 830.8401 843.0932 860.7583 886.5671 907.2247 920.5398 947.6263 984.1326 990.3139 994.7888 1003.3748 1033.1107 1051.7420 1058.1695 1095.3381 1096.7496 1120.3727 1133.8328 1155.4889 1160.7109 1164.7671 1197.0089 1210.4674 1224.9633 1236.4903 1247.6512 1261.2919 1279.1687 1283.9377 1309.9782 1312.8884 1348.4305 1357.0121 1371.8611 1376.8797 1393.4180 1420.9975 1422.3113 1443.6616 1453.2880 1455.9624 1457.9568 1459.7713 1463.8700 1464.2740 1466.3297 1477.3934 1478.7960 1481.0204 1483.7891 1487.1094 1496.9897 1584.0824 1607.7578 1622.7640 1636.7875 2977.6764 2985.1120 2996.0212 3022.0446 3023.0312 3027.5317 3034.7735 3035.0477 3049.3989 3090.0598 3097.8134 3105.9144 3122.9134 3138.5640 3142.1679 3142.8052 3150.7733 3152.9404 3164.5537 3172.5318 3593.3195
redmass: 3.4671 3.4641 3.5371 4.9978 3.9070 3.5959 3.9263 2.8439 3.7176 1.2497 1.2616 1.4504 1.4482 2.9762 2.9605 2.8763 3.1910 3.7289 4.3302 4.2357 2.7012 2.4397 2.9228 3.0726 3.6827 3.7817 3.9354 1.4879 2.5513 4.1481 4.6607 5.6723 5.1355 3.1058 4.9581 2.9513 4.1608 2.7756 1.6562 3.1395 3.8752 1.5104 3.3373 3.2638 2.0697 1.5517 2.9540 1.7402 1.3512 2.4464 2.3897 2.2050 2.7353 2.2958 2.1901 1.2745 1.5893 1.6743 1.7209 2.0494 1.3310 1.3675 1.6028 2.3102 1.4593 2.4054 1.4986 1.1186 1.6593 1.8216 1.6886 1.6118 1.2997 1.4137 2.1132 1.2290 1.4947 2.2456 1.1795 1.1293 1.2150 1.1001 1.5502 1.2197 1.3134 2.8671 1.1743 3.2266 1.0688 1.0808 1.1178 1.0600 6.7523 6.2762 10.0189 7.3587 1.0626 1.0611 1.0362 1.0524 1.0624 1.0373 1.0595 1.0687 1.1036 1.0979 1.1030 1.1088 1.1064 1.1056 1.1051 1.1050 1.0897 1.1050 1.0926 1.0968 1.0812
irintensity: 0.2713 2.4244 0.7395 0.7009 1.9352 0.3288 0.6462 3.9005 5.7808 1.1760 1.8163 1.9585 0.0683 0.8531 0.0948 10.5978 3.3705 8.6999 3.4784 2.3617 5.6192 1.6467 4.7808 0.7592 0.9094 1.3982 5.6080 60.9609 26.3617 4.6555 5.9758 6.1178 7.1579 5.8014 35.8844 2.3408 5.2192 1.2510 2.5531 10.3422 7.1067 36.2614 6.1922 42.5109 9.6164 14.3204 23.7210 6.3909 0.3426 5.1069 32.0045 1.6920 164.7258 109.2038 20.5307 0.9828 13.5299 47.8258 19.6657 13.5136 1.9683 2.8173 0.8755 275.8839 13.8151 24.0520 8.4104 2.4005 0.2347 53.2990 25.7562 17.8180 4.5579 6.0474 40.6971 24.3536 15.1336 7.3897 18.3789 1.7703 21.5640 9.3648 28.2834 14.8430 5.2955 36.1185 28.5814 6.3032 31.4524 17.1839 40.7903 23.1979 3.9137 29.5307 144.5355 61.5014 34.2043 27.0166 16.3594 1.2119 2.6108 8.2757 28.3904 17.1822 3.3530 31.9972 2.4030 7.3460 25.4787 0.2834 3.7800 5.5905 2.8765 1.0656 0.7772 4.3641 90.0903
temp: 298.150 k
press: 1.00000 atm
elementType: 8 8 7 7 6 6 6 6 6 6 6 6 6 6 6 6 6 6 6 6 1 1 1 1 1 1 1 1 1 1 1 1 1 1 1 1 1 1 1 1 1
symmnumber: 1
zpe: 909427.6 jmol-1
zpe.correction: 0.346383 hartree
zpe.thermalcorrener: 0.365177 hartree
zpe.thermalcorrenthalpy: 0.366122 hartree
zpe.thermalcorrgfe: 0.299433 hartree
zpe.sumelectzpe: -880.553607 hartree
zpe.sumelectthermal: -880.534812 hartree
zpe.sumelectthermalent: -880.533868 hartree
zpe.sumelectthermalfe: -880.600556 hartree
dipole: -17.0224 -4.3969 0.4769
dipole: 17.5876
quadrupole: -41.6298 -80.0015 -112.9379
quadrupole: 2.3338 -1.4290 2.3710
quadrupole: 36.5599 -1.8118 -34.7482 2.3338 -1.4290 2.3710
hfenergy: -880.8999895 hartree
pointgroup: C01 [X(C16H21N2O2)]
dipole: -6.7599048 1.4656726 0.1867242 debye
polarizability: 279.5741271|7.3322006|194.9675325|-5.5772572|16.0742087|115.5280985 unknown
InChI: InChI=1S/C16H21N2O2/c1-4-20-16(19)11-5-6-14-12(9-11)13-10-18(2,3)8-7-15(13)17-14/h5-6,9,17H,4,7-8,10H2,1-3H3
charge 1 multiplicity 1
41 atoms
O  3.469432 1.436194 0.381236
O  4.621511 -0.516095 -0.185197
N  -3.651934 1.418713 0.163332
N  -1.616292 -2.243594 -0.373693
C  -2.163419 1.295255 0.592161
C  -4.420308 0.154781 0.633452
C  -1.61796 -0.045161 0.201823
C  -3.929077 -1.138991 -0.045982
C  -2.426957 -1.15365 -0.046983
C  -3.751034 1.584869 -1.351223
C  -4.264166 2.639564 0.842102
C  -0.237328 -0.454755 0.033979
C  -0.270175 -1.849281 -0.327375
C  1.009342 0.204996 0.153503
C  0.905765 -2.592501 -0.570218
C  2.1868 -0.533236 -0.091446
C  2.130317 -1.917434 -0.448974
C  3.542065 0.091095 0.016737
C  4.778264 2.158957 0.511361
C  5.24624 2.690083 -0.845062
H  -2.150415 1.468285 1.686033
H  -1.621204 2.129589 0.110396
H  -5.489026 0.337571 0.430157
H  -4.264426 0.103332 1.724623
H  -4.340845 -1.22676 -1.071233
H  -4.353469 -1.985402 0.528405
H  -3.345194 2.571379 -1.622862
H  -3.160098 0.797465 -1.838919
H  -4.80798 1.519334 -1.652409
H  -4.293999 2.474628 1.92996
H  -3.64471 3.521709 0.61783
H  -5.284519 2.795157 0.459501
H  -1.944595 -3.180006 -0.60628
H  1.092676 1.258936 0.433662
H  0.874253 -3.652038 -0.842341
H  3.077308 -2.437286 -0.624494
H  4.552538 2.969621 1.222282
H  5.515291 1.462604 0.94728
H  6.163029 3.292215 -0.706787
H  5.483189 1.862056 -1.533305
H  4.479208 3.335699 -1.30673
