program: Gaussian 09
title: 000218278
version: EM64L-G09RevD.01
frameworkgroup: C1[X(C17H22N2O2)]
method: RPBEPBE
basis: SDD
operation: Freq
keyword: #p
keyword: freq=noraman
keyword: PBEPBE/SDD
title: #p freq=noraman PBEPBE/SDD
converged: NO YES NO NO
title: Mulliken charges:
elementType: O O N N C C C C C C C C C C C C C C C C C H H H H H H H H H H H H H H H H H H H H H H
charge: -0.450146 -0.265582 -0.217954 -0.051893 0.219459 0.079467 -0.511920 -0.513461 0.190398 -0.444766 0.215884 -0.427028 -0.355983 -0.522870 -0.348016 -0.630494 -0.336423 0.271581 -0.380183 -0.692737 0.068437 0.234586 0.221545 0.238715 0.221845 0.224262 0.233299 0.222151 0.221291 0.204125 0.221191 0.279840 0.238185 0.205713 0.227384 0.223002 0.194776 0.196688 0.267292 0.219869 0.216071 0.212960 0.379438
chargesum: 0.00000
title: Mulliken charges with hydrogens summed into heavy atoms:
elementType: O O N N C C C C C C C C C C C C C C C C C
charge: -0.070708 -0.265582 -0.217954 -0.051893 0.219459 0.079467 -0.055788 -0.052901 0.190398 0.012795 0.215884 0.016413 0.069334 -0.243031 -0.109831 0.025606 0.055041 0.271581 -0.112892 -0.043837 0.068437
polarizability: 2.88698033e+02 2.13182721e+01 2.24971504e+02 8.90420102e+00 -1.35020833e+01 1.28032424e+02
1716.lowfreq: -10.2732 -6.0425 -0.0007 -0.0002 0.0006 7.8217 26.0869 34.2599 50.8913
frequency: 25.9369 34.1677 50.8854 65.4084 68.9149 78.8577 108.3081 108.7387 129.3940 163.0762 188.1356 206.4564 213.6690 221.1371 231.7046 251.5377 273.8672 309.8526 324.0328 350.9814 383.5479 396.9535 423.7004 434.0980 439.8882 460.7177 510.3835 550.3579 553.1265 576.0335 594.5149 607.9936 638.5128 666.3274 699.3371 720.1110 725.7428 736.8930 764.0268 768.8409 784.3154 826.2221 835.5268 869.3169 902.6298 914.8086 924.9365 938.7019 954.1984 965.9545 992.9232 1000.9262 1006.6842 1017.4336 1026.9749 1040.8272 1070.9102 1110.8842 1113.0376 1120.0630 1125.9656 1138.7951 1151.9932 1161.6004 1182.4850 1189.5424 1212.7332 1245.4104 1265.9336 1267.7483 1278.9475 1284.3144 1287.7318 1291.7681 1313.7634 1330.2733 1340.8056 1343.8517 1345.4758 1356.6485 1378.1998 1394.6601 1410.2739 1416.3475 1429.1024 1448.4461 1456.0793 1461.2445 1462.1843 1464.0786 1469.7749 1473.0868 1479.2029 1481.9632 1486.9874 1490.8102 1492.8655 1573.8611 1583.5693 1622.7748 1635.3670 2885.0714 2953.9575 2956.9415 2963.9499 2977.7618 2981.4628 2987.7222 2996.7645 3006.4027 3007.7012 3019.0115 3027.7030 3035.0822 3057.9465 3061.9506 3074.8965 3075.4418 3078.0886 3138.1436 3164.9385 3168.7478 3530.3698
redmass: 3.8054 4.4387 4.8215 3.1497 1.9197 3.6984 3.1165 3.6934 3.9131 3.4356 2.8790 3.3071 1.7043 1.5790 1.3351 2.1776 3.5066 4.2846 4.8400 4.3394 2.5446 2.0086 3.0319 2.9081 3.4050 5.7946 4.8083 2.3477 2.6929 3.9542 3.8103 2.2006 4.7149 4.8661 4.7466 2.9179 4.0334 1.2011 3.0304 3.7828 1.4429 1.5544 2.6832 2.4984 1.7528 2.2794 1.5235 1.4540 1.8917 1.3356 4.1562 3.4007 2.6509 2.5538 2.6738 3.0073 2.5309 1.8689 2.2709 1.3599 1.7412 1.6874 1.4086 1.3914 1.3758 2.9288 1.5999 1.6084 1.5202 1.4635 1.3274 1.6169 1.1519 1.2599 1.9532 1.7779 1.5884 1.4213 1.4070 1.6264 2.9045 1.2131 3.6327 5.8486 1.1785 1.1054 1.1075 1.6858 1.0611 1.5341 1.1662 1.1755 1.0421 1.3197 2.1459 1.0648 1.2202 6.8241 7.1422 7.4385 8.3138 1.0534 1.0612 1.0654 1.0591 1.0366 1.0595 1.0663 1.0601 1.0994 1.0914 1.0765 1.0966 1.1017 1.1052 1.1045 1.1008 1.1009 1.0995 1.0886 1.0947 1.0936 1.0640
irintensity: 0.1126 0.0558 0.5678 0.7720 0.1982 0.3166 0.2393 0.1219 0.0956 2.8448 0.8548 3.0901 0.9574 0.1106 0.2953 1.3859 1.3053 0.9457 2.4315 1.8162 1.6166 2.9175 12.3236 2.1689 5.1484 15.9102 20.3357 39.4546 27.6410 24.5127 25.8914 50.8449 7.3379 12.1216 1.3628 30.7331 54.3996 2.0453 1.6183 7.3834 1.1480 27.5742 10.0474 14.8544 5.1959 7.4273 13.2868 5.5234 13.2889 1.3208 47.8678 81.9773 154.3342 16.9327 19.3868 12.1175 0.0357 24.8563 16.4433 6.6027 70.7106 97.8151 11.7574 1.6887 16.6959 11.3387 14.2567 8.9868 3.5658 2.5892 6.7026 2.1680 0.6867 2.5543 57.7068 38.9566 20.3005 7.3424 2.2120 71.7538 98.3362 10.5503 17.1779 44.6153 6.2744 6.5073 12.3727 13.7607 17.9579 7.5441 0.7574 2.8312 12.2877 18.4670 29.7992 3.7331 38.3102 19.8014 7.2197 58.2846 436.3190 85.2925 41.4484 47.1929 28.1945 31.1875 14.2141 36.9901 67.2011 5.0094 56.6026 64.0672 15.5350 5.1917 42.0562 17.9335 67.7094 38.7149 53.2520 10.1507 7.1321 0.8834 44.5701
temp: 298.150 k
press: 1.00000 atm
elementType: 8 8 7 7 6 6 6 6 6 6 6 6 6 6 6 6 6 6 6 6 6 1 1 1 1 1 1 1 1 1 1 1 1 1 1 1 1 1 1 1 1 1 1
symmnumber: 1
zpe: 944153.7 jmol-1
zpe.correction: 0.359609 hartree
zpe.thermalcorrener: 0.379903 hartree
zpe.thermalcorrenthalpy: 0.380847 hartree
zpe.thermalcorrgfe: 0.309636 hartree
zpe.sumelectzpe: -919.411247 hartree
zpe.sumelectthermal: -919.390953 hartree
zpe.sumelectthermalent: -919.390009 hartree
zpe.sumelectthermalfe: -919.461220 hartree
dipole: 5.6451 0.6736 0.6921
dipole: 5.7271
quadrupole: -122.6029 -128.4564 -126.3363
quadrupole: -14.0756 5.2985 1.6070
quadrupole: 3.1956 -2.6579 -0.5378 -14.0756 5.2985 1.6070
hfenergy: -919.7708557 hartree
pointgroup: C01 [X(C17H22N2O2)]
dipole: -2.231466 -0.0887611 0.2995099 debye
polarizability: 291.3677834|16.1805648|222.653655|-10.0438764|11.9503463|127.680522 unknown
InChI: InChI=1S/C17H22N2O2/c1-3-4-8-19-15-6-5-12(17(20)21)10-13(15)14-11-18(2)9-7-16(14)19/h5-6,10,20H,3-4,7-9,11H2,1-2H3
charge 0 multiplicity 1
43 atoms
O  4.968138 -0.508188 -0.660618
O  5.162225 1.714744 -0.026792
N  -1.18495 0.443275 0.509423
N  -1.391695 -3.711487 -0.261994
C  -1.424564 -0.899084 0.127661
C  -0.220387 -1.510299 -0.21877
C  -2.764861 -1.580964 0.137302
C  -0.165668 -2.962558 -0.660735
C  0.821622 -0.514731 -0.076152
C  -2.616484 -2.954308 -0.610213
C  0.181936 0.701649 0.376988
C  -2.207057 1.431909 0.886003
C  -2.687644 2.301425 -0.301058
C  2.219706 -0.524102 -0.275835
C  0.913852 1.887148 0.623888
C  -1.364195 -4.185726 1.138892
C  -3.74096 3.346402 0.130465
C  2.956006 0.659698 -0.025821
C  2.302166 1.85359 0.420635
C  -4.225606 4.219998 -1.046742
C  4.421102 0.714706 -0.215152
H  -3.114325 -1.74951 1.177477
H  -3.545358 -0.975652 -0.366146
H  -0.06514 -3.026408 -1.763964
H  0.714515 -3.478153 -0.232887
H  -3.497888 -3.586969 -0.398911
H  -2.592234 -2.762624 -1.70004
H  -3.065711 0.893257 1.327119
H  -1.792064 2.079812 1.681827
H  -3.111433 1.644322 -1.086292
H  -1.816436 2.812881 -0.754869
H  2.745412 -1.419698 -0.618536
H  0.425461 2.806856 0.962207
H  -1.277151 -3.375036 1.901738
H  -0.506536 -4.868387 1.274868
H  -2.287586 -4.756937 1.345289
H  -4.608746 2.829073 0.589094
H  -3.312569 3.996486 0.920765
H  2.918297 2.740754 0.597859
H  -4.977368 4.959539 -0.716559
H  -3.38369 4.773555 -1.502332
H  -4.686113 3.59968 -1.838228
H  5.949178 -0.383032 -0.765353
