program: Gaussian 09
title: 000218260
version: EM64L-G09RevD.01
frameworkgroup: C1[X(C11H12N2)]
method: RPBEPBE
basis: SDD
operation: Freq
keyword: #pfreq=noraman
keyword: PBEPBE/SDD
title: #p freq=noraman PBEPBE/SDD
converged: NO YES NO NO
title: Mulliken charges:
elementType: N N C C C C C C C C C C C H H H H H H H H H H H H
charge: -0.441266 -0.084532 -0.078950 0.262627 0.335367 0.174076 -0.773886 -0.406001 -0.406075 -0.783133 -0.222337 -0.222333 -0.242656 0.295824 0.252058 0.211781 0.252103 0.241142 0.241127 0.226513 0.226582 0.269335 0.223384 0.223383 0.225867
chargesum: 0.00000
title: Mulliken charges with hydrogens summed into heavy atoms:
elementType: N N C C C C C C C C C C C
charge: -0.145442 -0.084532 -0.078950 0.262627 0.335367 0.174076 -0.057944 -0.164859 -0.164947 -0.060703 0.001047 0.001050 -0.016789
polarizability: 1.74784670e+02 -5.44046950e-01 9.91897207e+01 2.76789726e-03 7.08292835e-03 1.04219986e+02
1716.lowfreq: -123.1316 -56.0446 -8.0894 -5.9393 -1.6821 -0.0009 -0.0008 -0.0008 74.0904
frequency: -123.1269 -56.0249 74.0897 81.8957 99.0465 187.0887 220.3901 250.7076 261.0341 333.4239 400.1434 408.0584 421.6058 548.7033 604.3779 612.0403 642.8985 659.3649 661.8285 704.2043 721.5299 746.9808 777.7749 853.0804 921.8060 953.1769 975.2686 986.3712 988.6388 993.9694 1002.9386 1010.7853 1035.2957 1043.0598 1047.8000 1074.4174 1146.7939 1170.2893 1184.5897 1227.8503 1287.5422 1308.2706 1350.3129 1368.3695 1396.4886 1407.9234 1411.8247 1428.1663 1460.0508 1469.7432 1471.4622 1478.9500 1485.0162 1533.4143 1581.1035 1583.5529 1625.4675 2975.0478 2980.7577 3047.2322 3062.3039 3075.6792 3115.4624 3118.7952 3126.0136 3138.4728 3147.4097 3161.7561 3573.3941
redmass: 1.0196 3.8405 4.0949 2.6706 1.2076 3.0256 3.0224 3.4863 3.9072 4.8390 2.8556 5.1323 3.0560 3.1727 4.2288 6.2892 1.8461 1.9348 6.1381 1.6941 7.5628 3.3099 2.3896 1.2437 1.4352 1.5849 1.3858 2.6549 5.1055 1.3649 3.1580 3.1171 1.4111 2.0757 1.4540 1.5950 6.7417 1.0534 1.1127 1.5006 4.7809 1.3667 4.0841 7.0342 1.4363 1.3308 2.3643 2.2070 1.0436 1.4063 1.0444 1.7626 1.1490 4.5635 6.1358 6.0460 7.0397 1.0392 1.0367 1.0984 1.0985 1.0990 1.0956 1.0842 1.0876 1.0925 1.0969 1.1018 1.0812
irintensity: 0.1317 0.6723 2.5286 5.3563 1.0782 0.5587 1.5217 0.0847 2.5981 1.4462 0.1863 4.3774 5.7973 8.2610 1.0988 0.0688 59.3876 34.8742 6.4924 54.8250 0.0942 10.7781 41.2228 0.0004 3.3498 4.0680 0.0332 3.3820 0.1303 0.2877 7.9913 18.8057 0.9827 0.6196 5.4285 10.8553 1.8466 0.0070 0.8498 10.5406 23.1402 0.1748 58.3031 0.0062 8.5853 3.8352 5.8206 5.7204 17.1648 2.5175 16.7096 0.5046 17.2353 40.7785 19.6417 1.3496 2.6481 55.8420 32.3174 23.9362 13.7951 25.1257 6.7506 1.4750 0.9844 24.8413 44.1974 21.3057 24.2188
temp: 298.150 k
press: 1.00000 atm
elementType: 7 7 6 6 6 6 6 6 6 6 6 6 6 1 1 1 1 1 1 1 1 1 1 1 1
symmnumber: 1
zpe: 533554.2 jmol-1
zpe.correction: 0.203220 hartree
zpe.thermalcorrener: 0.213675 hartree
zpe.thermalcorrenthalpy: 0.214619 hartree
zpe.thermalcorrgfe: 0.166672 hartree
zpe.sumelectzpe: -534.952388 hartree
zpe.sumelectthermal: -534.941932 hartree
zpe.sumelectthermalent: -534.940988 hartree
zpe.sumelectthermalfe: -534.988936 hartree
dipole: 2.4842 3.3208 0.0008
dipole: 4.1472
quadrupole: -57.1404 -78.3736 -72.9561
quadrupole: 4.8016 0.0017 0.0001
quadrupole: 12.3496 -8.8836 -3.4661 4.8016 0.0017 0.0001
hfenergy: -535.1556076 hartree
pointgroup: C01 [X(C11H12N2)]
dipole: 0.9793578 1.3050148 -0.000389 debye
dipolederiv: -0.599148 -0.1809181 0.0001546 -0.1548045 -0.3450575 0.0000906 -0.0000299 0.0000093 -0.241959 -0.556262 -0.0220133 0.0000577 -0.1205705 -0.3946774 0.000093 -0.0000783 0.000097 -0.2343498 0.4650336 0.0054199 -0.0001182 0.0898079 0.0087055 0.000009 0.0000609 0.0000019 -0.1120359 0.1902264 0.1446141 -0.0000968 0.0633674 0.1690358 -0.0001383 0.0001204 0.0004305 -0.046761 0.3290301 0.0770289 -0.0000519 0.0068692 -0.0549507 0.0000275 -0.0001001 -0.0000288 0.01866 0.3936579 -0.0142653 0.0001593 0.14956 0.4146776 -0.0003137 0.0002736 -0.0003886 0.0002793 0.0396655 0.0547811 -0.0002708 0.0620698 -0.0267306 0.0001118 -0.0001143 -0.0003248 0.0731757 -0.1443291 -0.020573 -0.0778837 -0.0269402 -0.131776 0.0133802 -0.0400326 0.0064962 0.0544338 -0.1443466 -0.0204265 0.0778926 -0.0268303 -0.1318265 -0.0130623 0.0400717 -0.006214 0.0544568 -0.0487103 0.0617999 -0.0000723 -0.0309648 -0.0183777 -0.0000468 -0.0002369 0.0000978 0.1101602 -0.0357523 0.0050251 0.0832234 0.0173402 -0.1528147 0.0074085 0.0719931 -0.0004943 0.0776581 -0.0357383 0.0048987 -0.0832201 0.017267 -0.1528065 -0.0070671 -0.0720161 0.0008288 0.0776658 0.084353 0.0143827 -0.0000136 0.0195028 -0.1690357 0.0000834 -0.0000241 0.0000887 -0.0581467 0.1519557 -0.0386587 -0.0000038 -0.0461891 0.1566871 0.0001033 -0.0000127 0.0000907 0.3215993 0.0505941 0.0662939 0.0976265 0.0474769 0.0155315 -0.0027267 0.0997922 -0.0794213 -0.03152 -0.1016687 -0.1540117 0.0005645 -0.068822 -0.0248676 0.0002672 0.0004329 0.0004736 0.1186762 0.0498859 0.0663288 -0.0979486 0.0473726 0.0162272 0.0023883 -0.1001768 0.0789193 -0.0309158 0.0528207 -0.0033835 0.0992196 -0.0051474 0.1378248 0.0066424 0.0948712 0.0091198 -0.0451479 0.0528087 -0.0035291 -0.0992233 -0.0053044 0.1378009 -0.0069231 -0.0948702 -0.0093905 -0.0451414 -0.074127 0.0503638 0.0891266 0.002165 0.071971 0.0656967 0.1550162 0.0122368 -0.0544898 -0.073825 0.0504925 -0.089095 0.0024581 0.0720187 -0.0655456 -0.1549811 -0.0120949 -0.0548696 0.1056845 -0.0869656 -0.0000664 0.0042509 -0.0644892 -0.0000675 0.0000072 -0.0001296 0.125073 0.001151 -0.0158022 -0.0917519 -0.0106728 0.1538466 -0.0060277 -0.1124191 -0.0106969 -0.0813467 0.0011618 -0.0156632 0.0917692 -0.0105052 0.1538717 0.0056706 0.11243 0.0103461 -0.0813763 -0.1541218 -0.025219 0.0000223 -0.0227564 0.1592118 -0.0000536 0.0000228 -0.0000527 0.0862216 unknown
polarizability: 174.782821|-0.6600975|99.1915782|0.0031503|0.0097342|104.2199774 unknown
InChI: InChI=1S/C11H12N2/c1-8-11(13-9(2)12-8)10-6-4-3-5-7-10/h3-7,12H,1-2H3
charge 0 multiplicity 1
25 atoms
N  2.700837 0.75296 -0.000513
N  1.454755 -1.121356 0.00021
C  0.605678 0.010464 -0.00007
C  1.365007 1.188806 -0.000868
C  -0.879062 -0.104569 0.000066
C  2.71589 -0.643478 0.0004
C  0.969472 2.639941 -0.001615
C  -1.60198 -0.162909 -1.220249
C  -1.601936 -0.161069 1.220495
C  3.973477 -1.459727 0.001204
C  -3.011191 -0.269988 -1.222093
C  -3.011146 -0.268157 1.222552
C  -3.720595 -0.321048 0.000282
H  3.518566 1.362305 -0.000822
H  0.363895 2.892204 0.887758
H  1.853164 3.303533 -0.004111
H  0.360392 2.890177 -0.889147
H  -1.051177 -0.133704 -2.167438
H  -1.051105 -0.130434 2.167623
H  4.597568 -1.267788 -0.892469
H  4.596112 -1.268341 0.896019
H  3.693748 -2.524546 0.000676
H  -3.553613 -0.316706 -2.173478
H  -3.553535 -0.31345 2.174025
H  -4.813518 -0.40522 0.000366
