program: Gaussian 09
title: 000218248
version: EM64L-G09RevD.01
frameworkgroup: C1[X(C12H14N2O)]
method: RPBEPBE
basis: SDD
operation: Freq
keyword: #p
keyword: freq=noraman
keyword: PBEPBE/SDD
title: #p freq=noraman PBEPBE/SDD
converged: YES YES NO NO
title: Mulliken charges:
elementType: O N N C C C C C C C C C C C C H H H H H H H H H H H H H H
charge: -0.267747 -0.093586 -0.121091 0.378858 0.093159 -0.324152 -0.354548 -0.401976 0.333611 -0.384014 -0.362047 -0.256048 -0.615553 -0.240232 -0.687156 0.260193 0.214616 0.274279 0.244439 0.241486 0.261069 0.244387 0.235729 0.244537 0.207021 0.207019 0.205578 0.231088 0.231081
chargesum: 0.00000
title: Mulliken charges with hydrogens summed into heavy atoms:
elementType: O N N C C C C C C C C C C C C
charge: -0.267747 -0.093586 -0.121091 0.378858 0.093159 -0.063959 -0.139933 -0.127698 0.333611 -0.139575 -0.120560 0.005021 0.109100 0.173808 -0.019409
polarizability: 2.64307757e+02 -3.50646148e+00 1.37696531e+02 -2.08875813e-02 3.08017233e-03 7.36553513e+01
1716.lowfreq: -1.9504 -0.0002 0.0007 0.0008 3.1368 9.6536 34.0289 49.0354 82.6339
frequency: 33.9873 49.0184 82.6339 90.3443 90.7242 115.5923 160.8174 166.6086 241.6581 245.2256 256.0579 309.8506 369.7280 381.1682 414.8838 433.0776 482.0317 522.1197 610.4369 614.4964 630.6794 684.5399 690.4397 724.4152 754.8943 775.8135 792.1627 815.0347 827.9995 845.5225 903.2768 915.0849 952.2777 975.2149 999.3344 1024.4124 1037.2754 1043.8001 1057.1423 1110.5218 1118.4342 1119.7674 1136.5333 1177.0742 1186.2738 1212.9124 1221.7392 1262.1122 1270.4502 1305.3084 1342.6420 1361.5258 1367.6272 1377.8826 1399.1231 1419.1773 1427.0635 1461.2760 1462.1483 1469.1924 1477.8777 1486.0916 1491.8399 1495.5995 1561.2196 1578.6843 1628.8908 2952.5137 2990.3894 2995.7351 3009.8326 3076.1875 3093.2147 3104.3205 3106.6543 3128.5698 3148.1378 3162.5721 3169.0275 3225.8456 3237.3319
redmass: 3.7940 3.2326 4.0589 3.9406 1.1846 1.7508 3.6997 3.6679 4.7963 1.3667 3.0470 3.5474 3.5603 6.0825 3.0388 4.5270 4.1354 2.5767 2.6987 5.6980 6.9670 2.3721 4.6068 2.2545 2.5718 4.6498 1.5259 1.1865 1.3180 1.4646 3.2898 7.3599 1.3741 1.3563 3.0600 4.9956 2.7859 2.3365 1.5373 1.5482 1.8407 1.3198 1.4412 1.2533 1.6671 1.5850 3.0373 1.1403 4.1156 1.3904 3.6869 2.0439 3.9828 2.6334 1.2965 1.9063 3.4887 1.0402 2.1242 1.0418 1.1129 1.4501 1.0988 1.4067 5.3666 7.4199 6.4266 1.0553 1.0342 1.0361 1.1073 1.1025 1.0989 1.1013 1.1002 1.0883 1.0874 1.0953 1.0960 1.0966 1.1008
irintensity: 6.3293 0.5975 4.4361 0.0223 0.1083 2.4436 0.3551 4.4722 0.1152 0.1049 1.7851 0.6170 0.9009 0.0244 0.1323 1.8250 2.7491 15.8896 16.5926 16.1760 1.5536 0.0620 18.1203 6.4033 3.7431 3.0452 81.3265 1.2277 38.4575 30.7941 50.0473 10.1409 0.0019 1.7375 4.5508 13.5887 50.7054 32.3470 2.6882 7.5895 13.0378 0.8721 4.3397 106.5215 44.8492 61.2439 223.6282 0.0573 26.9367 4.1491 6.2883 6.9435 47.1848 4.2831 29.0506 31.0578 3.1012 11.5755 157.5245 15.2384 13.6864 28.2196 21.6938 28.8836 35.7762 6.6371 48.7899 43.3614 86.4415 29.5369 38.1924 23.7746 31.1323 36.6221 12.0595 17.0648 8.9999 13.7112 10.2052 4.7043 0.6901
temp: 298.150 k
press: 1.00000 atm
elementType: 8 7 7 6 6 6 6 6 6 6 6 6 6 6 6 1 1 1 1 1 1 1 1 1 1 1 1 1 1
symmnumber: 1
zpe: 618763.0 jmol-1
zpe.correction: 0.235674 hartree
zpe.thermalcorrener: 0.249908 hartree
zpe.thermalcorrenthalpy: 0.250852 hartree
zpe.thermalcorrgfe: 0.193489 hartree
zpe.sumelectzpe: -649.297857 hartree
zpe.sumelectthermal: -649.283624 hartree
zpe.sumelectthermalent: -649.282680 hartree
zpe.sumelectthermalfe: -649.340042 hartree
dipole: -2.7069 1.1695 0.0014
dipole: 2.9488
quadrupole: -48.2532 -85.1001 -93.5764
quadrupole: -13.3431 0.0010 0.0055
quadrupole: 27.3900 -9.4568 -17.9332 -13.3431 0.0010 0.0055
hfenergy: -649.5335317 hartree
pointgroup: C01 [X(C12H14N2O1)]
dipole: -1.0566859 0.4786447 0.015138 debye
polarizability: 264.1289734|-5.8141265|137.6969502|1.4597545|3.2229762|73.8337158 unknown
InChI: InChI=1S/C12H14N2O/c1-3-15-11-6-4-10(5-7-11)12-8-14(2)9-13-12/h4-9H,3H2,1-2H3
charge 0 multiplicity 1
29 atoms
O  3.800647 0.510061 -0.023755
N  -4.113434 0.197569 -0.113656
N  -2.496251 -1.389708 -0.17724
C  -0.424637 0.038045 -0.087143
C  -1.887845 -0.114136 -0.108486
C  -2.886921 0.872878 -0.069086
C  0.201778 1.314949 -0.014758
C  0.405257 -1.11087 -0.139145
C  2.41486 0.277019 -0.048424
C  1.600712 1.437251 0.004533
C  1.811703 -1.004267 -0.120399
C  -3.820447 -1.16328 -0.178348
C  -5.445766 0.810472 -0.092558
C  4.69361 -0.662855 -0.074515
C  6.124004 -0.13126 -0.032277
H  -2.836883 1.957012 -0.016167
H  -0.408591 2.224683 0.027477
H  -0.077464 -2.091747 -0.194811
H  2.086946 2.416119 0.060358
H  2.41784 -1.91414 -0.161653
H  -4.595086 -1.925913 -0.222862
H  -5.582573 1.485798 -0.955493
H  -6.208785 0.017155 -0.146207
H  -5.601611 1.383325 0.83863
H  4.48413 -1.324871 0.791168
H  4.503031 -1.23287 -1.007457
H  6.843445 -0.969591 -0.067618
H  6.31719 0.533221 -0.891732
H  6.29834 0.441752 0.894425
