program: Gaussian 09
title: 000218211
version: EM64L-G09RevD.01
frameworkgroup: C1[X(C4H10N4OS2)]
method: RPBEPBE
basis: SDD
operation: Freq
keyword: #p
keyword: freq=noraman
keyword: PBEPBE/SDD
title: #p freq=noraman PBEPBE/SDD
converged: YES YES NO NO
title: Mulliken charges:
elementType: S S O N N N N C C C C H H H H H H H H H H
charge: 0.184202 0.149815 -0.174215 -0.578960 -0.591356 -0.385371 -0.303327 -0.509030 -0.553952 -0.090329 -0.093209 0.269641 0.277509 0.269777 0.304359 0.335635 0.322535 0.327056 0.326998 0.239364 0.272859
chargesum: 0.00000
title: Mulliken charges with hydrogens summed into heavy atoms:
elementType: S S O N N N N C C C C
charge: 0.184202 0.149815 -0.174215 0.079209 0.062697 -0.146007 -0.030469 0.038120 0.020185 -0.090329 -0.093209
polarizability: 1.26246632e+02 1.51729135e+01 1.22763174e+02 -4.86766433e+00 3.16526592e+00 8.97598977e+01
1716.lowfreq: -15.5369 -8.1358 -0.0029 -0.0019 -0.0010 9.1399 18.8706 32.7237 60.9144
frequency: 15.9710 32.1789 60.9007 91.7004 99.5919 114.6138 183.5270 227.8177 275.1438 294.7619 338.9251 352.4398 382.9058 396.9158 412.4177 432.7080 452.9133 456.2528 471.1511 562.3745 568.7292 579.5984 596.6344 607.4537 698.8685 739.6742 798.4693 827.9611 900.5705 966.0104 1003.3044 1037.4611 1054.5917 1064.7514 1085.6470 1241.6804 1244.2794 1258.0766 1294.7166 1310.0886 1334.9567 1416.4080 1441.5721 1595.0305 1597.6963 1628.6225 1701.2993 2978.1777 3018.1036 3089.3738 3135.9546 3355.8883 3363.0841 3522.4706 3545.9211 3668.6635 3700.9271
redmass: 6.8117 5.5740 6.3953 5.0675 5.0819 6.3658 6.0827 2.7498 3.2412 6.1215 3.0382 1.2716 1.1244 4.1370 4.3580 3.3674 2.0754 2.2839 1.2500 3.6828 3.4919 5.4893 5.2131 3.0624 5.2757 1.3478 1.1428 5.0750 1.5652 1.7344 3.1113 2.5694 1.3254 1.3963 1.7804 1.1023 2.4856 1.1046 1.4629 1.8084 1.1831 1.0844 1.0730 1.1667 2.6796 1.4948 6.2219 1.0612 1.0584 1.1051 1.1081 1.0806 1.0773 1.0450 1.0445 1.1043 1.1046
irintensity: 4.4655 0.9581 13.4707 1.1382 4.5814 6.4243 3.0794 4.8613 8.5328 12.2785 6.8606 75.4175 10.2235 6.7149 19.3184 44.4010 104.9474 107.5572 271.5732 35.9003 6.3202 89.3079 48.8047 50.7640 37.3800 109.7260 81.3891 93.1330 31.8770 13.5034 98.6963 198.3445 63.6910 144.5830 98.7226 9.6268 221.1282 4.2285 98.8566 73.6375 9.8780 10.3018 17.2590 92.0380 118.8179 251.8710 255.8150 44.5435 30.2791 9.9584 4.2725 183.4785 7.8674 46.2776 48.2722 26.9784 33.2283
temp: 298.150 k
press: 1.00000 atm
elementType: 16 16 8 7 7 7 7 6 6 6 6 1 1 1 1 1 1 1 1 1 1
symmnumber: 1
zpe: 410486.2 jmol-1
zpe.correction: 0.156346 hartree
zpe.thermalcorrener: 0.170219 hartree
zpe.thermalcorrenthalpy: 0.171164 hartree
zpe.thermalcorrgfe: 0.113887 hartree
zpe.sumelectzpe: -1247.861061 hartree
zpe.sumelectthermal: -1247.847187 hartree
zpe.sumelectthermalent: -1247.846243 hartree
zpe.sumelectthermalfe: -1247.903519 hartree
dipole: -3.5600 -1.9165 0.4760
dipole: 4.0710
quadrupole: -65.6087 -75.1718 -77.7782
quadrupole: 3.1967 -6.2399 4.0729
quadrupole: 7.2441 -2.3189 -4.9253 3.1967 -6.2399 4.0729
hfenergy: -1248.0174067 hartree
pointgroup: C01 [X(C4H10N4O1S2)]
dipole: -1.2289199 -0.9575466 0.3716799 debye
dipolederiv: -0.3169357 -0.1490687 -0.0107626 -0.3650538 -0.6218263 0.1239854 -0.0635766 0.095793 -0.2606794 -0.3208566 -0.0675011 -0.001027 0.1573624 -0.7461494 -0.1518959 0.1656001 -0.1790844 -0.2083256 -1.4691652 -0.1703747 -0.0538575 0.0820439 -0.5197278 -0.0509465 -0.2891246 0.0441494 -0.2805249 -0.9839924 -0.3769465 0.0677621 -0.5101334 -0.8926817 -0.1899316 0.1508711 -0.0386742 -0.417899 -1.0325921 0.1988501 0.1897267 0.4100888 -0.4694367 -0.3129251 0.2795247 -0.1613462 -0.8646688 -0.8892953 -0.0023753 -0.3605862 0.0280483 -0.3703608 -0.2215103 -0.3293409 -0.0058063 -0.9533104 -0.9495303 -0.2463745 0.2699971 -0.3291258 -0.9590849 0.2139749 0.3466765 0.171426 -0.6115588 1.1396328 0.4589882 0.0375509 0.6352123 0.7675067 0.0868314 0.0488026 0.1694096 0.1415639 1.0504633 -0.3394914 0.0283006 -0.587117 0.2922313 0.1419415 0.3056231 0.1625613 0.2936855 0.8265444 0.5130358 0.3840198 0.7205321 0.9913823 -0.1656501 0.3824169 -0.3849815 1.0588606 0.8933311 0.2236447 -0.6133549 0.0298549 1.4698611 0.2668397 -0.7766109 0.1995377 0.7935164 -0.0453752 0.0465785 -0.0285249 0.0173507 -0.0545635 0.0345051 -0.0824424 0.0292532 0.0837001 0.000692 -0.0215182 0.0111146 -0.1028231 0.0383833 -0.0149105 0.070695 -0.0807119 -0.0549883 -0.0618052 0.0148455 -0.0388269 0.0063515 -0.0168099 -0.1081125 -0.0592646 -0.10428 -0.0118819 0.0781764 0.0661405 0.037958 0.1150672 0.0759298 0.0562185 -0.0517804 0.0169487 0.0481267 0.3550241 -0.0087495 -0.0817089 -0.0459827 0.2501494 0.061244 -0.0940845 0.0416219 0.1999055 0.3165707 -0.0205841 -0.0935445 -0.0519048 0.1875423 0.0724104 -0.1202981 0.0474294 0.1946344 0.3085264 -0.052193 0.089644 -0.0482487 0.1446345 -0.0123355 0.1098964 -0.0337356 0.2625484 0.3607472 -0.0326346 0.0447253 -0.0565521 0.1488882 0.0183729 0.0619513 0.0135573 0.2864914 0.2357303 -0.0980576 0.1087088 -0.1217535 0.0343828 0.2466409 0.026397 0.1283583 0.1306769 0.5041093 0.0637856 0.0126854 0.0167829 0.2497493 -0.0947467 -0.0819314 -0.1314257 0.1701273 unknown
polarizability: 119.1697437|15.6754266|126.9785067|-9.8965622|1.1585482|92.6214531 unknown
InChI: InChI=1S/C4H10N4OS2/c5-3(6)10-1-9-2-11-4(7)8/h5,7H,1-2,6,8H2
charge 0 multiplicity 1
21 atoms
S  -1.864822 0.30166 -0.975469
S  2.516594 1.135249 -0.377723
O  0.017476 2.347634 -0.319039
N  -2.796561 -1.890891 0.26294
N  3.038299 -1.195534 -1.60819
N  -1.23398 -0.557498 1.559198
N  1.305765 -1.496019 -0.049792
C  -1.342328 1.953369 -0.123985
C  1.00884 1.703573 0.561986
C  -1.948708 -0.818137 0.488974
C  2.154405 -0.728691 -0.649075
H  -1.9551 2.715104 -0.626075
H  -1.615116 1.809473 0.93653
H  1.387428 2.472617 1.25447
H  0.554164 0.86156 1.117537
H  -3.360018 -1.940309 -0.584411
H  -2.764159 -2.706867 0.872269
H  3.018587 -2.190063 -1.825071
H  3.576207 -0.557879 -2.188487
H  -1.403085 -1.190937 2.363316
H  0.680109 -1.088814 0.667496
