program: Gaussian 09
title: 000218175
version: EM64L-G09RevD.01
frameworkgroup: C1[X(C18H34N4S2)]
method: RPBEPBE
basis: SDD
operation: Freq
keyword: #p
keyword: freq=noraman
keyword: PBEPBE/SDD
title: #p freq=noraman PBEPBE/SDD
converged: NO YES NO NO
title: Mulliken charges:
elementType: S S N N N N C C C C C C C C C C C C C C C C C C H H H H H H H H H H H H H H H H H H H H H H H H H H H H H H H H H H
charge: 0.059987 -0.005808 -0.065082 -0.102182 -0.617513 -0.624446 -0.070257 -0.133673 -0.408388 -0.456277 -0.429878 -0.434199 -0.403279 -0.397450 -0.348361 -0.359829 -0.400522 -0.352965 -0.410620 -0.398093 0.151868 0.297193 -0.782335 -0.794078 0.174714 0.160057 0.201504 0.205330 0.218486 0.208055 0.219993 0.180197 0.203085 0.214270 0.198094 0.175931 0.188376 0.190312 0.205072 0.183332 0.188925 0.186669 0.185786 0.191859 0.180721 0.226277 0.194863 0.189558 0.195336 0.191425 0.299144 0.279490 0.286541 0.290798 0.321542 0.314319 0.321518 0.314605
chargesum: 0.00000
title: Mulliken charges with hydrogens summed into heavy atoms:
elementType: S S N N N N C C C C C C C C C C C C C C C C C C
charge: 0.059987 -0.005808 -0.065082 -0.102182 0.018348 0.011677 0.104457 0.026384 -0.001554 -0.029736 -0.029687 -0.016844 -0.029255 -0.018762 0.040043 0.015765 -0.022876 0.054033 -0.026198 -0.011332 0.151868 0.297193 -0.203701 -0.216739
polarizability: 3.04686359e+02 1.33453302e+01 2.74783740e+02 1.46186970e+01 -8.79846570e+00 2.18371682e+02
1716.lowfreq: -23.4868 -14.3443 -8.8362 -5.2352 0.0007 0.0011 0.0012 13.7993 20.6213
frequency: -23.0514 12.5646 20.3978 25.0228 28.3858 35.8878 42.7279 64.0371 66.7557 83.6574 86.2072 116.4716 138.7946 144.5804 161.1696 180.5637 197.2500 211.4355 214.2007 255.7317 261.2621 263.7703 276.2768 281.7848 304.4422 309.8326 322.9048 357.7884 390.3723 392.2135 404.2595 407.6943 412.3094 446.1700 454.3004 463.9919 475.1813 489.1127 494.9361 509.5029 518.8643 536.3649 565.7982 581.4731 597.5283 616.3934 679.8907 726.9592 728.9895 730.2208 778.5779 780.8092 814.1416 818.2359 825.3187 838.5819 844.5854 845.2828 867.5793 871.1810 880.7623 884.5499 887.9956 919.7020 945.0059 951.0515 970.2319 971.4984 999.1798 1003.9640 1018.6050 1018.9384 1031.5516 1036.7050 1057.5978 1076.9946 1083.6770 1089.2492 1126.2284 1129.9809 1138.7142 1145.0211 1150.1648 1166.2838 1173.0725 1181.3363 1187.2050 1192.5861 1200.5553 1203.0218 1224.9775 1226.0776 1235.9115 1236.8507 1268.1691 1269.9587 1272.3214 1277.8833 1294.7503 1303.7490 1321.9331 1325.9561 1327.2178 1330.9743 1332.0907 1334.5415 1337.2814 1341.8646 1345.7298 1348.9029 1351.0423 1355.6615 1356.4063 1357.1635 1364.6886 1380.2072 1402.6530 1456.2223 1456.5319 1459.2371 1461.2419 1462.5287 1463.1229 1464.2846 1465.7161 1466.8483 1477.6319 1479.2024 1481.4362 1482.2450 1594.7848 1597.8772 1637.9396 1640.7188 2848.1821 2904.5421 2940.4137 2950.3370 2952.2784 2958.6106 2959.2768 2965.1605 2966.1660 2973.3650 2974.1654 2976.3423 2980.1074 2980.5789 3004.7335 3006.6648 3007.2355 3009.6626 3014.8528 3015.3227 3024.2239 3024.6489 3026.6803 3034.9337 3036.2471 3041.0124 3045.0346 3046.7177 3123.4819 3130.8308 3503.2418 3546.6360 3661.0618 3704.8998
redmass: 3.7009 3.6664 4.7442 4.0195 5.0807 4.6327 4.1646 3.4571 3.5758 4.6523 4.9381 5.0761 1.9215 5.2776 3.2465 2.9923 2.9954 3.1105 3.0089 2.2704 2.4830 2.3696 3.2433 1.7238 3.5318 2.0841 2.1613 2.0487 2.9178 2.6413 4.7451 2.9802 3.2798 1.2124 2.1723 2.0306 2.4067 1.9469 1.9916 2.0006 2.3426 1.2662 1.9928 2.3231 2.7258 3.3266 4.6727 3.1019 2.6239 2.5372 2.4203 2.1864 1.6360 1.7496 1.6828 2.2996 2.0748 1.9613 2.7918 2.2068 1.9968 2.4394 1.6246 2.3155 2.2173 2.1791 2.0586 2.5199 1.6466 1.5191 2.0102 1.8588 1.9795 1.4076 2.3461 1.8568 1.2486 1.7495 2.1926 1.9841 1.7034 2.5933 1.2339 1.6035 1.9624 1.4697 1.4505 1.2488 1.2413 1.3404 1.2092 1.2185 1.2394 1.2323 1.2250 1.2044 1.1928 1.1455 1.2552 1.2137 1.2885 1.3723 1.4167 1.8747 2.5779 1.4542 1.9727 1.3312 1.4508 1.5153 1.4655 1.4181 1.4312 1.5996 1.4234 1.3204 1.0890 1.0997 1.0814 1.0839 1.0827 1.0838 1.0834 1.0908 1.0875 1.0863 1.0828 1.0852 1.0829 1.0849 1.3869 1.4091 3.6043 4.0071 1.0811 1.0805 1.0636 1.0602 1.0619 1.0625 1.0604 1.0646 1.0619 1.0628 1.0621 1.0627 1.0647 1.0646 1.0932 1.0661 1.0931 1.0982 1.0961 1.0997 1.1015 1.1010 1.1012 1.1022 1.0991 1.0989 1.1013 1.0602 1.0988 1.1054 1.0475 1.0447 1.0996 1.1047
irintensity: 0.0515 0.0806 0.2834 0.3283 0.3341 0.4366 0.2280 0.4448 2.3551 0.5236 1.3498 0.2090 0.1165 3.5604 1.9315 0.8893 1.1563 2.6408 0.5349 9.0423 11.5978 30.5628 32.1271 72.2301 0.6601 28.8764 0.7216 0.7609 1.3392 3.2251 4.7681 6.4116 43.0445 78.1355 4.3823 2.6339 5.6348 41.8094 2.4483 7.0649 34.3216 155.4289 33.6096 7.8016 26.7849 1.7031 10.6488 1.0243 1.5861 1.1557 2.3752 2.8693 8.4478 7.5972 6.8052 3.9989 1.7379 0.5018 0.4129 4.1697 2.6266 2.6285 2.8491 5.2612 6.5135 4.9415 25.6094 9.2918 12.9871 2.9464 2.7947 1.2927 4.8439 0.5321 1.3485 0.4765 6.7557 12.6990 0.1685 0.4436 1.6921 1.5652 6.5918 11.8137 0.7115 1.3019 9.3979 0.9825 5.2040 2.0445 4.5304 1.1056 6.4820 5.7881 2.1078 2.5375 2.0081 1.6529 10.6593 1.9549 13.2290 0.3472 11.7937 17.5539 93.9054 1.0520 20.3423 0.3168 3.5910 2.1011 10.9846 0.2572 1.3588 8.5528 7.6602 18.5705 9.4064 18.9992 2.4812 9.5505 7.7638 8.3018 13.2367 12.2574 4.7673 9.7843 1.9839 26.7000 13.3530 27.5264 68.5034 76.4564 73.3420 650.5248 59.2465 43.4735 35.2873 31.9830 37.2316 36.9208 29.8133 30.8317 28.2929 39.5381 30.8864 17.6002 39.8286 3.2072 101.7999 17.6777 75.0120 22.4980 116.6707 17.5411 61.5710 46.7527 39.5896 32.5524 71.9750 70.3793 93.7522 19.2213 2.4118 6.3405 41.3415 59.3363 33.2256 24.7113
temp: 298.150 k
press: 1.00000 atm
elementType: 16 16 7 7 7 7 6 6 6 6 6 6 6 6 6 6 6 6 6 6 6 6 6 6 1 1 1 1 1 1 1 1 1 1 1 1 1 1 1 1 1 1 1 1 1 1 1 1 1 1 1 1 1 1 1 1 1 1
symmnumber: 1
zpe: 1325476.3 jmol-1
zpe.correction: 0.504847 hartree
zpe.thermalcorrener: 0.531637 hartree
zpe.thermalcorrenthalpy: 0.532581 hartree
zpe.thermalcorrgfe: 0.444774 hartree
zpe.sumelectzpe: -1719.501566 hartree
zpe.sumelectthermal: -1719.474776 hartree
zpe.sumelectthermalent: -1719.473832 hartree
zpe.sumelectthermalfe: -1719.561640 hartree
dipole: -0.1750 -2.4415 -0.0514
dipole: 2.4483
quadrupole: -148.7594 -161.2854 -161.0914
quadrupole: 0.7753 0.8641 4.3438
quadrupole: 8.2860 -4.2400 -4.0460 0.7753 0.8641 4.3438
hfenergy: -1720.0064132 hartree
pointgroup: C01 [X(C18H34N4S2)]
dipole: -0.1702862 0.9476628 -0.0279832 debye
polarizability: 296.6747464|18.7288833|283.0588405|-15.9963423|4.5717656|218.1081931 unknown
InChI: InChI=1S/C18H34N4S2/c19-17(21-15-9-5-1-2-6-10-15)13-23-24-14-18(20)22-16-11-7-3-4-8-12-16/h15-16H,1-14,19-20H2
charge 0 multiplicity 1
58 atoms
S  1.919398 3.16306 -0.610232
S  0.941526 3.839673 1.336756
N  3.697636 -0.006244 -1.126008
N  -1.632154 0.885761 0.41995
N  4.795325 1.887423 -1.932992
N  -1.897121 3.290075 0.153912
C  2.771182 -0.71376 -0.210174
C  -2.763332 0.579106 -0.501016
C  3.579195 -1.487259 0.876141
C  1.85996 -1.613883 -1.091371
C  -2.489151 -0.786889 -1.187107
C  -4.095227 0.643591 0.306395
C  2.793764 -1.660842 2.200664
C  1.129207 -2.775876 -0.369868
C  -2.911088 -2.050424 -0.39567
C  -5.322545 -0.030346 -0.359961
C  1.62223 -2.672825 2.168527
C  0.57294 -2.467904 1.046535
C  -4.386201 -2.464805 -0.63187
C  -5.456201 -1.535043 -0.010468
C  3.958586 1.269429 -1.001369
C  -1.308884 2.133561 0.665601
C  3.435389 2.219443 0.077771
C  -0.206947 2.362134 1.690276
H  2.104328 -0.004126 0.33222
H  -2.827908 1.333265 -1.326877
H  4.502517 -0.912051 1.086136
H  3.907788 -2.469466 0.483295
H  2.491994 -2.026284 -1.90114
H  1.117718 -0.951496 -1.579155
H  -1.403136 -0.817692 -1.395814
H  -3.00146 -0.803381 -2.170577
H  -4.316626 1.707369 0.525712
H  -3.914777 0.163878 1.288493
H  3.498603 -1.971657 2.998781
H  2.402324 -0.665722 2.506252
H  1.810591 -3.647825 -0.287714
H  0.299062 -3.103909 -1.027683
H  -2.711449 -1.90229 0.684091
H  -2.265365 -2.893084 -0.714111
H  -5.289437 0.103543 -1.460962
H  -6.240884 0.485315 -0.014703
H  2.038645 -3.697381 2.065617
H  1.113248 -2.642458 3.153982
H  -0.272062 -3.156577 1.249026
H  0.145501 -1.44498 1.080206
H  -4.545261 -3.488211 -0.23419
H  -4.55477 -2.52933 -1.727921
H  -6.457066 -1.894659 -0.326225
H  -5.424406 -1.632073 1.094792
H  3.101675 1.664996 0.965062
H  4.192843 2.962288 0.374501
H  -0.635997 2.621432 2.677611
H  0.38685 1.442202 1.780704
H  5.152971 1.322146 -2.700456
H  5.043229 2.870007 -1.865185
H  -2.636068 3.229986 -0.542516
H  -1.4069 4.178266 0.269932
