program: Gaussian 09
title: 000218173
version: EM64L-G09RevD.01
frameworkgroup: C1[X(C8H12N2O3S3)]
method: RPBEPBE
basis: SDD
operation: Freq
keyword: #p
keyword: freq=noraman
keyword: PBEPBE/SDD
title: #p freq=noraman PBEPBE/SDD
converged: YES YES NO NO
title: Mulliken charges:
elementType: S S S O O O N N C C C C C C C C H H H H H H H H H H H H
charge: 0.218920 0.113751 0.968538 -0.557073 -0.538828 -0.493896 -0.081966 -0.643141 -0.066413 -0.488634 -0.028125 -0.265775 -0.259132 0.334542 -0.875222 -0.759946 0.240521 0.229453 0.246903 0.250399 0.304202 0.331513 0.240471 0.236149 0.240697 0.341084 0.380746 0.380261
chargesum: 0.00000
title: Mulliken charges with hydrogens summed into heavy atoms:
elementType: S S S O O O N N C C C C C C C C
charge: 0.218920 0.113751 0.968538 -0.176812 -0.538828 -0.493896 -0.081966 0.078689 -0.066413 -0.018660 -0.028125 -0.018872 -0.008733 0.334542 -0.239507 -0.042629
polarizability: 7.52642183e+02 3.54244193e+01 1.75376748e+02 2.26941765e+00 2.38723536e+00 1.10687542e+02
1716.lowfreq: -14.1242 -5.3943 -3.4287 -0.0018 0.0011 0.0025 14.3489 20.0912 30.0834
frequency: 14.1280 19.4164 29.8371 42.5610 73.4674 85.1372 100.7047 105.6395 118.7394 139.1494 145.6988 161.3647 199.2218 211.2586 229.0721 255.4320 264.8704 277.4239 278.6465 304.0376 332.2691 404.0249 436.0978 465.8394 475.6419 519.9445 526.9194 556.2189 558.0167 597.5992 620.4693 651.4613 716.3491 733.5839 773.6166 798.4059 806.7775 839.9791 878.9696 888.9385 908.7844 926.4687 964.1147 989.5919 1036.6785 1050.1592 1057.8380 1107.3864 1155.5802 1163.3757 1184.2084 1202.9616 1217.5862 1252.5000 1287.5073 1340.9208 1368.4574 1398.4533 1402.2116 1421.7130 1456.8726 1466.2136 1517.4519 1560.0783 1602.2656 1645.1459 2870.3337 2912.7120 2974.1088 3017.0872 3049.8668 3085.0480 3097.3207 3156.3223 3176.7522 3327.1194 3450.6346 3623.8922
redmass: 6.9353 5.9183 6.9224 6.7018 5.7462 6.5121 1.0842 8.3433 5.5562 9.1322 4.2593 3.8766 2.2309 2.3470 4.7953 4.0853 6.1550 3.3307 4.3538 4.5641 2.9110 14.1394 3.0929 4.2984 1.5318 4.3450 8.9221 3.3056 2.9202 5.2581 6.4058 5.0054 6.4959 5.6253 1.1387 1.2353 11.2083 1.9121 1.5090 3.6242 6.8307 1.8800 1.7029 3.1845 1.4168 1.3006 1.2345 1.2989 2.6602 1.9341 1.4070 2.1512 1.3382 1.1846 1.7094 2.2236 2.4544 1.2261 1.3225 1.0984 1.0440 1.1461 5.6069 5.2790 5.0751 1.2210 1.0569 1.0973 1.0366 1.0589 1.0977 1.0984 1.1031 1.0905 1.1000 1.0631 1.0660 1.0891
irintensity: 0.0436 0.1486 0.4242 1.1201 2.6354 0.9032 0.5286 14.6191 10.7401 43.3866 10.4340 14.8109 91.7855 42.1873 31.3580 38.6857 13.2058 0.8159 0.4344 19.1448 4.8307 38.1214 0.7659 20.3923 56.7802 126.8514 245.9718 21.9800 5.0871 28.0185 13.0366 8.9021 3.6382 3.1371 172.7002 64.5010 153.4619 4.6051 1.7607 7.6166 73.6265 11.2686 7.8536 7.8935 5.0597 45.1472 59.7233 18.4220 7.1089 21.8032 15.9757 34.0148 23.2064 16.2103 32.1158 8.4651 13.3991 5.2309 51.7396 15.9589 16.3276 69.6056 691.4053 5.2974 34.2592 172.6702 30.5438 25.7362 37.3317 2.0903 17.4161 27.3352 3.8907 6.9254 46.7110 3.5124 137.8125 28.2695
temp: 298.150 k
press: 1.00000 atm
elementType: 16 16 16 8 8 8 7 7 6 6 6 6 6 6 6 6 1 1 1 1 1 1 1 1 1 1 1 1
symmnumber: 1
zpe: 514769.0 jmol-1
zpe.correction: 0.196065 hartree
zpe.thermalcorrener: 0.215755 hartree
zpe.thermalcorrenthalpy: 0.216699 hartree
zpe.thermalcorrgfe: 0.144185 hartree
zpe.sumelectzpe: -1839.988393 hartree
zpe.sumelectthermal: -1839.968703 hartree
zpe.sumelectthermalent: -1839.967759 hartree
zpe.sumelectthermalfe: -1840.040273 hartree
dipole: 3.5373 2.5796 0.8301
dipole: 4.4560
quadrupole: -112.9805 -109.0309 -119.9494
quadrupole: -4.5798 -6.6662 3.6321
quadrupole: 1.0064 4.9560 -5.9625 -4.5798 -6.6662 3.6321
hfenergy: -1840.1844579 hartree
pointgroup: C01 [X(C8H12N2O3S3)]
dipole: -1.4971676 0.8397832 -0.3558999 debye
polarizability: 751.694213|11.2090645|171.4076474|-42.8676562|-12.1390474|115.6046121 unknown
InChI: InChI=1S/C8H11N2S2.HO3S/c1-6-2-3-7(12-6)4-10-8(9)5-11;1-4(2)3/h2-3H,4-5,9H2,1H3;1H
charge 0 multiplicity 1
28 atoms
S  -2.969957 -1.203669 0.418721
S  2.797972 -1.400531 -0.360367
S  4.791715 0.120669 -0.46115
O  4.78636 0.366241 -2.307191
O  4.299561 1.516366 0.235141
O  6.264298 -0.420253 -0.061312
N  -0.36721 0.169961 0.362633
N  1.430902 1.748653 -0.040625
C  -2.759904 0.5230 -0.058542
C  -1.373743 1.100115 -0.180812
C  -4.773933 -1.038003 0.265116
C  -3.986391 1.129526 -0.299885
C  -5.116322 0.253366 -0.117355
C  0.89607 0.552097 0.397101
C  1.891837 -0.424561 0.977933
C  -5.667581 -2.210855 0.553867
H  -1.164987 1.303374 -1.259908
H  -1.354182 2.091906 0.330835
H  -4.080599 2.177114 -0.599843
H  -6.153376 0.5688 -0.260159
H  2.648052 0.075094 1.609387
H  1.357263 -1.181878 1.575516
H  -5.547204 -2.576126 1.591372
H  -6.7243 -1.922294 0.417905
H  -5.460235 -3.063924 -0.119604
H  0.852755 2.446862 -0.504615
H  2.450167 1.900228 0.013887
H  5.742572 0.506824 -2.579141
