program: Gaussian 09
title: 000218169
version: EM64L-G09RevD.01
frameworkgroup: C1[X(C11H16N2O4S2)]
method: RPBEPBE
basis: SDD
operation: Freq
keyword: #p
keyword: freq=noraman
keyword: PBEPBE/SDD
title: #p freq=noraman PBEPBE/SDD
converged: YES YES NO NO
title: Mulliken charges:
elementType: S S O O O O N N C C C C C C C C C C C H H H H H H H H H H H H H H H H
charge: 0.067057 1.011328 -0.374593 -0.581100 -0.467655 -0.574681 -0.080334 -0.622256 -0.551474 0.459956 -0.481211 -0.342895 -0.436598 -0.377737 -0.357393 0.379793 0.328509 -0.848861 -0.527890 0.226793 0.213839 0.240240 0.176603 0.259086 0.248236 0.274141 0.245836 0.324185 0.293656 0.334664 0.375514 0.257734 0.238123 0.239032 0.430350
chargesum: 0.00000
title: Mulliken charges with hydrogens summed into heavy atoms:
elementType: S S O O O O N N C C C C C C C C C C C
charge: 0.067057 1.011328 -0.374593 -0.150750 -0.467655 -0.574681 -0.080334 0.087923 -0.110842 0.459956 -0.064367 -0.083808 -0.188362 -0.103596 -0.111557 0.379793 0.328509 -0.231020 0.206999
polarizability: 3.15492918e+02 2.19696658e+01 1.93174935e+02 1.38978018e+01 -1.85216256e+01 1.51320269e+02
1716.lowfreq: -14.2223 -10.9872 -0.0008 0.0014 0.0022 3.6897 37.8586 42.7760 60.2549
frequency: 37.7276 42.2799 60.1627 75.4264 87.1461 109.8790 116.7221 127.7760 131.8983 142.0695 150.5404 159.5965 175.6473 203.6353 220.4388 229.0281 252.8331 297.2222 305.6788 324.1759 327.5477 361.9981 383.9787 400.7165 412.0008 418.7857 456.0968 484.0903 513.2443 541.1379 570.3493 589.1105 628.4630 630.6804 687.4106 709.0488 720.6899 736.2183 783.1860 796.7745 807.5374 809.6773 826.0533 863.5935 878.1736 892.2107 934.2097 936.5085 941.6789 961.5140 986.5133 1002.9077 1006.4281 1033.0452 1102.5744 1116.6191 1120.8634 1153.6000 1158.2376 1175.5919 1178.5171 1206.3179 1216.4852 1224.5417 1232.2088 1242.0438 1289.5546 1311.9857 1338.2760 1357.3421 1388.6829 1403.6666 1414.8428 1435.8458 1462.4411 1466.1456 1472.5344 1489.1914 1496.8334 1590.4131 1591.9949 1614.3532 1670.7468 2749.2041 2902.1149 2986.1902 2996.2447 3017.8885 3028.1232 3064.7200 3086.3162 3092.1931 3118.3907 3138.9282 3149.4924 3162.5252 3173.8229 3305.7348 3601.0045
redmass: 5.3129 5.6409 5.8453 7.0543 4.7341 4.4635 7.1097 3.6306 7.3691 8.2736 8.5763 10.6385 2.7396 2.4642 2.6835 2.8735 5.1129 7.8052 2.6038 3.7699 7.2545 3.4137 3.0801 3.2315 17.7356 3.2173 2.9310 1.5877 3.6605 2.4603 2.8820 7.4312 4.4388 6.2262 3.9272 5.6936 3.5775 1.2024 3.1336 3.0872 3.8032 1.7689 1.4584 2.1416 1.1747 2.2311 1.7088 2.1860 7.6126 1.4126 7.0287 2.6825 2.6808 1.7667 1.2205 1.3756 1.2639 1.3963 1.4912 1.1911 1.3336 1.8021 2.6701 1.2737 1.1083 1.3403 1.2290 1.2635 1.3717 2.8307 6.4030 1.2534 2.9124 1.1516 1.1188 1.0518 1.0618 1.1483 2.3091 7.1262 6.0496 6.3407 1.1434 1.0767 1.0685 1.0317 1.0615 1.0581 1.0904 1.1022 1.1051 1.1040 1.0894 1.1022 1.0890 1.0936 1.0969 1.0643 1.0871
irintensity: 3.3037 0.9538 1.4842 0.0367 0.3747 5.3532 1.8799 2.2670 7.6788 3.1739 2.8751 11.6912 7.3988 3.9170 5.7639 9.0640 7.8742 4.3992 11.8245 2.0331 18.8518 1.6805 2.6287 1.0807 51.9167 0.5556 14.4809 56.2881 4.0368 19.0778 132.3825 55.5744 21.9896 2.3817 10.3169 12.8660 1.6722 275.0594 1.3666 11.3673 17.3367 48.4522 59.7516 1.7397 41.5217 4.8744 2.5259 2.1407 88.3646 2.1688 73.1812 5.4843 11.7036 6.7544 6.2029 17.3743 0.3923 7.9509 9.2435 4.9060 36.1121 40.1956 15.7128 28.2952 81.8394 10.6106 7.6812 1.8172 5.9105 17.5076 3.8855 40.2742 5.0973 4.5893 11.2296 24.4631 25.4891 18.4939 53.2274 9.6412 36.2727 7.5551 64.8304 1050.9104 92.5758 28.8765 44.8591 13.5268 64.7186 15.3911 26.2888 11.3557 10.7816 6.7915 4.0494 8.7891 0.1431 7.3140 45.4596
temp: 298.150 k
press: 1.00000 atm
elementType: 16 16 8 8 8 8 7 7 6 6 6 6 6 6 6 6 6 6 6 1 1 1 1 1 1 1 1 1 1 1 1 1 1 1 1
symmnumber: 1
zpe: 692499.1 jmol-1
zpe.correction: 0.263759 hartree
zpe.thermalcorrener: 0.284421 hartree
zpe.thermalcorrenthalpy: 0.285365 hartree
zpe.thermalcorrgfe: 0.214564 hartree
zpe.sumelectzpe: -1633.652117 hartree
zpe.sumelectthermal: -1633.631455 hartree
zpe.sumelectthermalent: -1633.630511 hartree
zpe.sumelectthermalfe: -1633.701312 hartree
dipole: -5.1899 4.3309 -2.2043
dipole: 7.1099
quadrupole: -142.9338 -116.3887 -128.4914
quadrupole: 5.8705 2.3594 -6.9899
quadrupole: -13.6625 12.8826 0.7799 5.8705 2.3594 -6.9899
hfenergy: -1633.915876 hartree
pointgroup: C01 [X(C11H16N2O4S2)]
dipole: -2.3867231 1.2212666 0.7978762 debye
polarizability: 198.4444874|-45.4572006|298.4069303|-15.7856477|-32.5292914|163.1367041 unknown
InChI: InChI=1S/C11H15N2OS.HO3S/c1-14-10-4-2-9(3-5-10)6-7-13-11(12)8-15;1-4(2)3/h2-5H,6-8,12H2,1H3;1H
charge 0 multiplicity 1
35 atoms
S  2.291791 -0.437533 -1.281254
S  2.047513 -2.099562 0.597084
O  -1.739102 -2.39967 0.487533
O  0.741423 -3.199087 0.024369
O  3.338412 -3.037993 0.78074
O  1.507867 -1.256068 1.894296
N  0.858608 2.861496 -0.696203
N  0.672818 1.382946 1.232576
C  -1.641655 3.105165 -1.089582
C  -1.92202 1.651039 -0.764146
C  -0.357906 3.621264 -0.339555
C  -1.346242 0.631678 -1.566508
C  -2.601355 1.266029 0.420788
C  -1.355379 -0.712446 -1.155757
C  -2.613889 -0.080241 0.860471
C  -1.938723 -1.048948 0.085511
C  1.263871 1.867782 0.078302
C  2.548869 1.164729 -0.304419
C  -2.346631 -2.857611 1.747614
H  -1.475136 3.232201 -2.174265
H  -2.482841 3.7623 -0.796346
H  -0.193266 4.668501 -0.654284
H  -0.576276 3.640819 0.754511
H  -0.831794 0.904278 -2.493431
H  -3.102704 2.028828 1.030119
H  -0.874345 -1.48812 -1.758211
H  -3.116144 -0.34422 1.795985
H  3.122417 1.804339 -0.998189
H  3.17779 0.935472 0.573515
H  -0.267678 1.682187 1.486681
H  1.015977 0.503051 1.650843
H  -2.066336 -3.917133 1.834588
H  -3.44502 -2.760096 1.695724
H  -1.945715 -2.289086 2.606891
H  -0.2089 -2.834385 0.24131
