program: Gaussian 09
title: 000218160
version: EM64L-G09RevD.01
frameworkgroup: C1[X(C5H12N2O4S2)]
method: RPBEPBE
basis: SDD
operation: Freq
keyword: #p
keyword: freq=noraman
keyword: PBEPBE/SDD
title: #p freq=noraman PBEPBE/SDD
converged: NO YES NO NO
title: Mulliken charges:
elementType: S S O O O O N N C C C C C H H H H H H H H H H H H
charge: 0.135947 0.964110 -0.439923 -0.550562 -0.526858 -0.482317 -0.071041 -0.639669 -0.412775 -0.454817 -0.307425 0.327808 -0.871307 0.178499 0.233447 0.206863 0.218824 0.170834 0.251859 0.306547 0.334032 0.341756 0.374966 0.326644 0.384558
chargesum: 0.00000
title: Mulliken charges with hydrogens summed into heavy atoms:
elementType: S S O O O O N N C C C C C
charge: 0.135947 0.964110 -0.113279 -0.166005 -0.526858 -0.482317 -0.071041 0.077053 -0.000828 -0.029130 0.115267 0.327808 -0.230729
polarizability: 2.87501552e+02 2.85699178e+01 1.24892114e+02 -1.14282151e+01 3.65677497e+00 1.01900353e+02
1716.lowfreq: -10.6686 -1.1564 -0.0005 0.0013 0.0015 7.5185 18.1167 32.1410 47.3356
frequency: 17.6930 32.1275 47.2820 73.2695 85.4039 99.7178 117.4625 131.6920 143.7349 150.9851 196.7014 208.6231 231.6441 246.5453 271.7931 285.6912 296.1518 312.5798 337.6763 399.8439 408.0150 476.0148 497.6370 535.4045 563.5667 627.3504 712.0735 745.5708 765.7066 816.2103 832.9305 852.4986 874.6475 920.6348 941.9990 977.2654 1026.6101 1066.3265 1071.0010 1072.9724 1103.8631 1149.4851 1174.3706 1215.0798 1249.9156 1284.0126 1305.0115 1337.6419 1348.6561 1365.9892 1381.5952 1400.5359 1436.6946 1457.1706 1484.1653 1592.0511 1640.6710 2881.3321 2935.9756 2939.0585 2978.5569 3014.8266 3057.5736 3095.2832 3104.0322 3371.0879 3451.5633 3554.9831 3629.9026
redmass: 7.2009 6.6518 8.8597 3.8465 2.8725 3.8001 6.0794 4.4590 6.0543 8.5549 3.2227 1.7712 3.9530 3.4794 7.1689 3.0297 1.8627 3.9637 1.6751 2.3000 13.9627 1.9705 2.0302 16.7785 2.6682 4.2653 5.5516 1.1264 1.5479 14.8937 1.7528 1.7404 2.6386 7.8540 2.5136 3.8735 2.3921 1.2431 1.7298 2.0048 1.2980 1.3158 1.5469 1.2662 1.1878 1.1386 1.2399 1.4832 1.4299 1.9914 1.3451 1.3180 1.0936 1.0856 1.0793 5.1100 1.2105 1.0584 1.0916 1.0767 1.0656 1.0586 1.0956 1.1037 1.0940 1.0598 1.0660 1.0662 1.0915
irintensity: 0.3159 1.1072 0.6447 1.9033 6.5027 2.9842 14.6107 7.5850 3.1446 9.2989 18.4007 68.9685 9.5314 16.1976 33.3759 13.2204 52.8367 2.1751 100.5376 17.7772 45.1588 19.9987 45.9192 201.2450 54.6664 20.8326 7.9311 140.5520 8.1405 84.0628 10.7452 0.4719 8.2058 59.0834 7.7032 163.3801 9.2354 61.6176 13.3502 0.5830 18.4625 68.6746 0.4685 9.9746 8.9734 2.7777 9.4628 55.1453 36.1719 12.1104 4.0700 45.5800 23.9241 12.8699 3.9133 37.0891 159.4584 39.8163 14.3631 97.9834 85.1398 7.9535 26.0843 15.1209 24.2533 10.2277 88.3794 5.9757 54.6240
temp: 298.150 k
press: 1.00000 atm
elementType: 16 16 8 8 8 8 7 7 6 6 6 6 6 1 1 1 1 1 1 1 1 1 1 1 1
symmnumber: 1
zpe: 480971.4 jmol-1
zpe.correction: 0.183192 hartree
zpe.thermalcorrener: 0.200419 hartree
zpe.thermalcorrenthalpy: 0.201364 hartree
zpe.thermalcorrgfe: 0.135921 hartree
zpe.sumelectzpe: -1402.999646 hartree
zpe.sumelectthermal: -1402.982419 hartree
zpe.sumelectthermalent: -1402.981475 hartree
zpe.sumelectthermalfe: -1403.046917 hartree
dipole: 0.5908 3.6446 2.4676
dipole: 4.4409
quadrupole: -101.9654 -96.2752 -89.1577
quadrupole: 14.1452 0.1472 2.3539
quadrupole: -6.1660 -0.4758 6.6417 14.1452 0.1472 2.3539
hfenergy: -1403.1828383 hartree
pointgroup: C01 [X(C5H12N2O4S2)]
dipole: -0.3515207 1.283176 -1.1324672 debye
dipolederiv: 0.5302995 -0.2989859 0.013163 -0.0034439 -0.1953905 0.1426969 -0.0954413 0.0273373 -0.050758 1.3115135 0.1162971 -0.1626351 0.3777955 1.1172023 0.0324667 -0.5892415 0.0871411 1.4466385 -0.836097 -0.2999764 0.1620631 -0.4310818 -0.5389336 -0.1890134 0.1410191 -0.1816903 -0.3750972 -0.5209046 0.1314628 0.2253544 0.1012393 -0.5078845 -0.077496 0.7268301 -0.1803753 -0.9684974 -0.4321684 0.0351917 0.0458811 -0.4786998 -0.5959994 -0.004477 0.0583916 0.0120066 -0.4267868 -1.1818108 0.1137979 -0.0939202 -0.1494977 -0.3797537 0.0202323 -0.0109364 0.0011686 -0.4653815 -0.5753666 -0.325659 0.118828 0.0566111 -0.4116105 -0.0039243 0.5794754 -0.1040936 -0.3465721 -0.3031237 -0.1959721 0.120298 0.087085 -0.8915385 0.0492834 0.0935185 0.2122534 -0.5162573 0.0808737 -0.0632626 0.0426515 -0.1368557 -0.0765177 -0.0622531 0.0922493 -0.0385983 0.1012455 0.8686893 -0.0718765 0.0292855 -0.2018109 0.2007009 0.1305465 -0.2894913 0.115455 0.2622026 0.6486061 0.1820348 -0.1114517 0.3321787 0.361566 0.0495911 -0.0266777 0.0614642 0.3554608 -0.1343395 0.6342916 -0.1437772 0.0816361 0.5812674 -0.3125216 -0.2956153 -0.3674838 0.2449077 0.0591145 -0.0102851 -0.0516302 -0.1064609 0.0383047 0.0645799 -0.029696 0.1336624 -0.0478569 -0.1674846 0.0882464 -0.0878935 0.0574823 -0.0077977 0.0581579 -0.1830043 0.0725789 0.0012415 0.1019517 0.0152061 0.0367456 -0.0414345 0.0440512 -0.0324317 0.0903476 -0.0600246 -0.1090699 -0.1677109 0.0347767 0.0642826 0.1423716 0.0613073 -0.0433697 -0.1290752 0.0124755 -0.1743987 -0.1020422 -0.0464739 -0.0402335 0.0883837 -0.2063933 0.0009561 -0.0215839 -0.0310867 0.0522796 -0.0286084 -0.020996 0.0797271 -0.0387614 0.0046709 -0.0189577 0.1083402 -0.0564886 -0.2186315 0.0085743 0.0620721 -0.0331702 0.1352421 0.0397059 0.0415608 -0.0597017 0.0559589 0.0353536 0.0146267 -0.0344119 -0.0576715 -0.0287709 0.0475303 -0.0801284 -0.0026423 -0.0122675 0.1319469 0.1549101 -0.0097899 0.0858395 0.0354266 0.1184569 -0.0193941 -0.0625838 0.0096244 0.1200577 0.203016 0.0089533 -0.0558977 -0.0688075 0.3196143 0.0614326 -0.0025512 0.0291348 0.2349116 0.0641669 -0.0585706 -0.0117596 0.0518661 0.2936372 0.0530832 0.0147431 0.059365 0.2255628 0.2141571 0.0815087 -0.085898 0.1866474 0.2351885 0.1628307 -0.0952211 0.1555763 0.2126549 0.1891572 -0.0675794 -0.088181 -0.0483405 0.3486154 -0.0234508 -0.0114519 -0.0130934 0.2748438 unknown
polarizability: 290.905679|-16.5766657|120.012482|-10.1224051|-6.6753699|103.3758575 unknown
InChI: InChI=1S/C5H11N2OS.HO3S/c6-5(4-9)7-2-1-3-8;1-4(2)3/h8H,1-4,6H2;1H
charge 0 multiplicity 1
25 atoms
S  1.598834 -1.279779 0.537001
S  3.52982 0.116358 -0.106319
O  -5.351848 -1.849111 0.062553
O  3.533451 -0.370075 -1.894104
O  3.015312 1.65997 0.008445
O  4.991789 -0.229685 0.48962
N  -1.631335 0.291753 0.545123
N  0.111221 1.704032 -0.383926
C  -4.03986 0.282709 -0.015321
C  -2.663323 0.904214 -0.323521
C  -4.071237 -1.227703 -0.311061
C  -0.389782 0.729832 0.463309
C  0.624566 0.09856 1.387409
H  -4.815623 0.803015 -0.615818
H  -4.279589 0.439202 1.052319
H  -2.414687 0.736651 -1.400051
H  -2.71493 2.007697 -0.17585
H  -3.838571 -1.413744 -1.383795
H  -3.316366 -1.740903 0.303822
H  1.347959 0.830828 1.78863
H  0.101798 -0.39983 2.221576
H  -0.48731 2.149585 -1.076814
H  1.117656 1.920297 -0.37888
H  -6.080833 -1.414292 -0.448449
H  4.48249 -0.300581 -2.214495
