program: Gaussian 09
title: 000218147
version: EM64L-G09RevD.01
frameworkgroup: C1[X(C19H20N2O)]
method: RPBEPBE
basis: SDD
operation: Freq
keyword: #p
keyword: freq=noraman
keyword: PBEPBE/SDD
title: #p freq=noraman PBEPBE/SDD
converged: YES YES NO NO
title: Mulliken charges:
elementType: O N N C C C C C C C C C C C C C C C C C C C H H H H H H H H H H H H H H H H H H H H
charge: -0.256348 -0.077539 -0.406319 -0.346322 -0.415896 0.089992 0.481114 0.259736 0.135526 0.212483 -0.374690 -0.457180 -0.378532 -0.619464 -0.618909 -0.395544 -0.360717 -0.225886 -0.238101 -0.244872 -0.212938 -0.247766 0.222888 0.224692 0.232579 0.266905 0.313579 0.226806 0.273756 0.205600 0.209635 0.242839 0.224260 0.219528 0.193353 0.287950 0.230808 0.222379 0.224400 0.224920 0.224369 0.226928
chargesum: 0.00000
title: Mulliken charges with hydrogens summed into heavy atoms:
elementType: O N N C C C C C C C C C C C C C C C C C C C
charge: -0.256348 -0.077539 -0.092740 -0.123434 0.041374 0.089992 0.481114 0.259736 0.135526 0.212483 -0.107785 -0.230374 -0.104777 0.038609 0.018232 -0.107594 -0.129908 -0.003507 -0.013702 -0.019952 0.011432 -0.020838
polarizability: 2.79155538e+02 -5.84031913e+00 1.97525398e+02 8.49512653e+00 -1.20736874e+01 2.06116829e+02
1716.lowfreq: -8.5020 -4.1382 -0.0006 -0.0003 0.0003 5.6465 19.9902 23.7753 34.6439
frequency: 19.8701 23.5589 34.6120 57.9730 64.5833 67.2632 113.4588 125.5324 145.9062 185.1670 216.6386 221.4011 225.0599 239.9026 267.0726 270.1301 292.4239 321.5350 340.6265 395.7312 404.3240 426.3948 432.6417 453.5969 498.1578 524.1951 553.4266 569.2068 581.2818 586.3664 612.6093 621.7091 631.8707 705.5525 706.0509 740.1922 757.9628 762.7631 769.7827 774.9982 804.8539 823.7958 855.1420 862.3079 866.5868 869.1527 905.2222 922.0987 948.7477 977.2132 989.0628 991.2645 995.3931 1001.5304 1010.1668 1025.0370 1029.1853 1037.3250 1058.2991 1081.9257 1089.3977 1091.9564 1128.9045 1136.3798 1144.5466 1166.3110 1170.1652 1171.9077 1188.2547 1194.7441 1227.5605 1242.7127 1248.5465 1263.7911 1271.9467 1296.6455 1319.1587 1332.5615 1354.4464 1364.0599 1380.8691 1393.9420 1421.7474 1422.5177 1440.2109 1442.5787 1450.8012 1461.2149 1462.4821 1472.7808 1477.4166 1478.8407 1483.5723 1487.6228 1520.8658 1557.7495 1589.7270 1590.6823 1608.6603 1631.9656 2860.4842 2882.3195 2891.0675 3016.2094 3021.0415 3023.8677 3040.0751 3073.7020 3077.9855 3110.2799 3123.9186 3128.3097 3135.3377 3141.0334 3146.2156 3159.8708 3161.6069 3184.9995 3231.8697 3599.3460
redmass: 5.1652 4.8663 3.8683 3.2442 3.6940 3.4551 4.5582 4.6221 6.0658 5.3392 2.2088 3.8923 2.3019 2.2730 2.1220 1.1793 4.8823 6.2858 2.1529 5.6913 2.8516 2.9137 2.2925 3.2846 4.9087 3.6554 3.8206 2.7928 1.9726 3.9186 4.9917 3.3012 4.4557 3.8208 1.9145 2.7246 1.3216 5.2758 2.8140 3.5467 2.3755 2.1809 1.2480 2.8250 3.7083 1.9004 4.7374 1.4495 1.3712 1.3978 5.0391 1.3123 1.3703 1.9618 2.0841 2.5314 2.2540 1.6383 2.6120 1.6556 1.9875 1.3747 1.6087 1.5003 1.5220 1.1388 1.2682 1.5759 1.1290 1.8946 1.5819 1.6924 2.2623 2.3185 1.9863 2.4141 1.3413 1.3026 1.8599 1.6003 7.1899 5.2812 1.1464 2.5391 1.9107 1.2297 3.5837 1.0491 1.0853 1.1120 1.0830 2.0761 3.0368 1.0553 5.1769 6.7107 6.2191 6.2698 6.0722 7.1421 1.0560 1.0567 1.0660 1.0733 1.0828 1.0762 1.0910 1.1011 1.1006 1.0870 1.0862 1.0858 1.0918 1.0913 1.0956 1.0976 1.1014 1.0963 1.0979 1.0810
irintensity: 2.8062 0.1799 0.2379 1.4558 0.3323 0.6552 1.0798 1.4793 2.8529 3.0714 1.7348 7.9392 1.1277 3.1540 1.9177 0.4047 0.7175 3.1306 9.2746 0.6047 0.0350 10.5835 0.7029 0.7281 1.2993 22.3760 5.6953 22.1516 47.9876 26.3056 5.4431 9.9995 6.6000 7.6213 35.8406 41.4037 108.2754 8.2369 7.6362 6.6668 16.3833 8.3540 0.4515 2.9998 0.1295 0.3987 103.1986 1.9714 3.7025 0.1135 0.1655 0.7015 0.0330 5.9267 15.4876 17.9527 5.4231 24.5877 59.6897 10.0109 20.6537 2.7553 82.7339 31.0324 6.7332 7.4659 4.8528 9.2597 0.2905 4.2786 3.5178 14.5886 22.4634 22.0003 17.8317 24.5373 16.9196 2.4995 8.7255 5.9391 2.4693 99.5949 1.4082 88.2844 10.6456 0.2088 28.1950 20.8385 5.0148 18.6212 10.0288 34.9042 0.2282 13.1221 81.4305 216.2945 3.0286 1.9244 17.9839 1.6315 135.3660 81.5633 78.5302 47.1132 17.8858 45.2984 18.8706 29.1549 72.7208 10.1285 0.2493 0.2824 22.2937 19.8770 23.0713 32.0176 28.8693 7.1674 0.0146 72.3684
temp: 298.150 k
press: 1.00000 atm
elementType: 8 7 7 6 6 6 6 6 6 6 6 6 6 6 6 6 6 6 6 6 6 6 1 1 1 1 1 1 1 1 1 1 1 1 1 1 1 1 1 1 1 1
symmnumber: 1
zpe: 903094.6 jmol-1
zpe.correction: 0.343971 hartree
zpe.thermalcorrener: 0.363772 hartree
zpe.thermalcorrenthalpy: 0.364717 hartree
zpe.thermalcorrgfe: 0.293709 hartree
zpe.sumelectzpe: -919.168735 hartree
zpe.sumelectthermal: -919.148933 hartree
zpe.sumelectthermalent: -919.147989 hartree
zpe.sumelectthermalfe: -919.218997 hartree
dipole: -1.1537 -1.0375 4.0613
dipole: 4.3476
quadrupole: -117.5133 -126.3147 -117.8219
quadrupole: 2.1385 -6.9974 -4.8285
quadrupole: 3.0366 -5.7647 2.7281 2.1385 -6.9974 -4.8285
hfenergy: -919.5127059 hartree
pointgroup: C01 [X(C19H20N2O1)]
dipole: -0.5737199 -0.4352032 1.551509 debye
polarizability: 277.4680742|-4.0419298|197.7306882|14.2555724|-12.4483964|207.5990031 unknown
InChI: InChI=1S/C19H20N2O/c1-21(2)13-17(14-8-4-3-5-9-14)19(22)16-12-20-18-11-7-6-10-15(16)18/h3-12,17,20H,13H2,1-2H3
charge 0 multiplicity 1
42 atoms
O  0.163798 0.835628 -1.617918
N  2.070304 2.979842 0.716189
N  -2.542346 -0.694801 1.847261
C  1.478018 0.536176 0.424268
C  2.39663 1.723995 0.002901
C  0.158709 0.516121 -0.382689
C  2.21295 -0.79859 0.237173
C  -1.076234 0.083844 0.280619
C  -2.402746 -0.002912 -0.328762
C  -3.302004 -0.491386 0.677575
C  -1.218932 -0.352585 1.611257
C  2.704555 -1.50651 1.363583
C  2.459527 -1.321028 -1.059722
C  0.767435 3.564683 0.334721
C  3.167087 3.966474 0.623496
C  -2.90756 0.288457 -1.621538
C  -4.677327 -0.696326 0.441218
C  3.427002 -2.710528 1.202387
C  3.182146 -2.523693 -1.221289
C  -4.281019 0.086656 -1.867795
C  -5.155454 -0.398696 -0.851951
C  3.668895 -3.223957 -0.092686
H  1.260209 0.676333 1.49908
H  3.438566 1.461826 0.261445
H  2.333648 1.831505 -1.107687
H  -0.468107 -0.452433 2.392116
H  -2.908601 -1.046386 2.730132
H  2.53033 -1.10661 2.370859
H  2.071868 -0.786907 -1.934599
H  0.692562 3.796885 -0.755995
H  0.605593 4.496567 0.905766
H  -0.054354 2.870706 0.582951
H  4.10447 3.518413 0.999361
H  2.930033 4.843593 1.252594
H  3.352604 4.331256 -0.418292
H  -2.229452 0.657184 -2.394905
H  -5.350633 -1.069981 1.220505
H  3.801513 -3.244708 2.08334
H  3.362982 -2.916716 -2.228352
H  -4.689028 0.305082 -2.860827
H  -6.217376 -0.54393 -1.079244
H  4.228236 -4.157646 -0.220248
