program: Gaussian 09
title: 000218128
version: EM64L-G09RevD.01
frameworkgroup: C1[X(C16H17NO)]
method: RPBEPBE
basis: SDD
operation: Freq
keyword: #p
keyword: freq=noraman
keyword: PBEPBE/SDD
title: #p freq=noraman PBEPBE/SDD
converged: YES YES NO NO
title: Mulliken charges:
elementType: O N C C C C C C C C C C C C C C C C H H H H H H H H H H H H H H H H H
charge: -0.240214 -0.320581 -0.328981 -0.463538 0.507964 0.134722 0.309487 -0.455280 -0.392608 -0.228020 -0.228893 -0.348919 -0.358800 -0.643613 -0.246220 -0.251146 -0.231612 -0.226175 0.229261 0.226869 0.241502 0.258292 0.230266 0.265331 0.224935 0.225832 0.243402 0.274778 0.214274 0.264057 0.192845 0.228559 0.229005 0.231494 0.231727
chargesum: 0.00000
title: Mulliken charges with hydrogens summed into heavy atoms:
elementType: O N C C C C C C C C C C C C C C C C
charge: -0.240214 -0.062289 -0.099720 0.004833 0.507964 0.134722 0.309487 -0.225014 -0.127278 -0.003086 -0.003061 -0.105517 -0.084022 0.027564 -0.017661 -0.022141 -0.000118 0.005552
polarizability: 2.03548252e+02 7.73617003e+00 1.80598825e+02 2.01114133e+00 2.05082447e+01 1.51924086e+02
1716.lowfreq: -6.8153 -6.3228 -3.3416 -0.0010 -0.0008 -0.0005 22.5418 28.6996 41.4413
frequency: 22.3235 28.6137 41.4296 50.5382 66.3992 79.0101 128.9631 141.1764 157.2964 189.1427 208.0046 248.3390 278.4659 333.6740 356.0057 396.4923 399.6978 404.3998 418.3871 479.5203 525.8971 544.3697 583.9257 612.6067 614.1853 645.3160 686.2718 694.2557 707.7010 742.3937 765.1419 787.0996 849.6510 854.0860 857.1499 907.5209 929.3855 941.1126 959.1453 978.9392 985.7917 988.8587 990.2470 992.7010 996.7637 1006.9639 1025.4676 1027.7555 1055.8832 1080.2654 1085.8731 1111.4013 1138.2764 1166.5256 1171.7475 1172.5348 1186.8287 1189.9235 1193.8260 1220.1758 1243.4103 1278.2733 1314.8719 1330.5968 1347.6343 1355.9942 1381.1616 1387.2204 1429.2964 1435.1586 1440.3078 1449.4095 1458.5995 1472.6797 1478.5873 1479.5672 1498.1486 1562.1671 1589.6144 1595.0166 1608.1411 1611.6327 2880.8641 2955.8881 3020.8322 3022.2495 3050.3001 3081.7586 3108.0091 3123.1031 3127.2273 3134.0152 3138.6629 3144.6384 3151.2017 3160.7493 3161.9733 3169.7132 3509.1032
redmass: 5.1931 3.7339 3.9185 2.5894 3.5555 3.3646 6.1955 3.7263 4.7242 1.3368 2.6095 4.3491 4.5489 6.4779 1.8905 3.3863 3.6295 2.8377 3.9901 4.4542 3.0271 1.7164 3.2716 6.2968 6.3805 4.6953 5.3119 1.7187 1.7260 2.6365 1.8511 2.5648 2.4438 1.5278 1.2500 2.3213 1.8573 1.4803 3.2628 1.3897 1.4778 4.1272 3.8864 2.4175 1.3311 1.3449 2.2515 2.1784 3.0417 1.5892 1.6285 1.2915 1.5360 3.3152 1.0951 1.0657 1.2114 1.1783 1.7527 2.3360 1.9421 1.5138 1.3169 1.2584 1.3479 1.2347 7.5170 9.2457 1.1310 2.2463 2.1668 1.2072 1.1188 1.0646 2.2023 2.2332 1.0483 7.5674 6.0159 6.4500 5.9770 6.3723 1.0553 1.0655 1.0837 1.0756 1.0970 1.1005 1.0877 1.0859 1.0851 1.0912 1.0885 1.0958 1.0926 1.0956 1.1014 1.1007 1.0757
irintensity: 1.5632 0.1207 0.1709 0.7460 0.6084 1.3378 1.1137 0.6483 0.6932 1.8643 0.6707 5.5213 0.2244 7.1923 23.5230 4.3200 5.9893 0.0667 2.4586 4.2531 27.7721 120.5858 3.7111 0.1531 0.6488 10.7455 2.4855 59.7143 56.1851 27.2666 40.9909 16.7777 3.5438 0.4687 0.5196 14.1701 4.1012 3.5133 35.9040 0.0701 1.1399 4.4618 1.1747 13.2413 0.0681 1.0959 7.8225 8.6967 17.2547 8.9268 15.0827 12.5753 12.5734 66.1303 5.9121 3.3443 39.7112 2.8645 6.8087 44.4143 106.0150 41.3857 0.0338 1.1096 30.0103 17.1479 0.3582 2.7769 7.6985 23.2350 9.6203 5.6700 20.6262 6.7959 12.6011 12.3151 10.7492 119.9435 1.7265 25.1958 17.4778 2.7788 182.8988 62.2019 13.5615 38.8470 13.9650 27.8329 11.3694 0.1877 0.1354 13.3843 8.3453 29.1462 18.2427 27.8508 25.1899 17.7089 0.1844
temp: 298.150 k
press: 1.00000 atm
elementType: 8 7 6 6 6 6 6 6 6 6 6 6 6 6 6 6 6 6 1 1 1 1 1 1 1 1 1 1 1 1 1 1 1 1 1
symmnumber: 1
zpe: 754183.4 jmol-1
zpe.correction: 0.287253 hartree
zpe.thermalcorrener: 0.304090 hartree
zpe.thermalcorrenthalpy: 0.305034 hartree
zpe.thermalcorrgfe: 0.240203 hartree
zpe.sumelectzpe: -748.567238 hartree
zpe.sumelectthermal: -748.550401 hartree
zpe.sumelectthermalent: -748.549457 hartree
zpe.sumelectthermalfe: -748.614288 hartree
dipole: -0.1591 -1.2437 -2.2280
dipole: 2.5566
quadrupole: -96.5730 -100.4346 -100.9986
quadrupole: -2.6196 1.2408 -0.6671
quadrupole: 2.7624 -1.0992 -1.6632 -2.6196 1.2408 -0.6671
hfenergy: -748.854491 hartree
pointgroup: C01 [X(C16H17N1O1)]
dipole: -0.0430227 -0.4868563 -0.8790991 debye
polarizability: 201.9935754|10.1825031|181.8462404|-1.0755974|20.5449915|152.2313476 unknown
InChI: InChI=1S/C16H17NO/c1-17-12-15(13-8-4-2-5-9-13)16(18)14-10-6-3-7-11-14/h2-11,15,17H,12H2,1H3
charge 0 multiplicity 1
35 atoms
O  0.4717 1.608354 1.387874
N  -0.701728 3.289705 -1.034787
C  -0.751413 0.821815 -0.572158
C  -1.517247 2.181663 -0.509139
C  -1.661572 -0.350993 -0.190067
C  0.486233 0.880986 0.349247
C  1.694176 0.04769 0.027435
C  -2.197718 -1.199627 -1.192715
C  -2.036689 -0.571824 1.16135
C  -3.084768 -2.246952 -0.85727
C  -2.921014 -1.620152 1.498785
C  1.699873 -0.932743 -1.001183
C  2.872877 0.247166 0.797761
C  -0.441482 4.429346 -0.138559
C  -3.448581 -2.46215 0.492195
C  2.860578 -1.694702 -1.253906
C  4.033742 -0.506822 0.539357
C  4.030867 -1.481058 -0.488905
H  -0.41254 0.689241 -1.615991
H  -2.47096 2.060999 -1.065128
H  -1.776946 2.38174 0.546692
H  -0.945799 3.563964 -1.990267
H  -1.923405 -1.034527 -2.242965
H  -1.62664 0.073252 1.947218
H  -3.489988 -2.892914 -1.644602
H  -3.197427 -1.781649 2.546991
H  0.797341 -1.119413 -1.590963
H  2.84702 1.001161 1.591379
H  0.256864 5.132336 -0.628807
H  0.042229 4.059285 0.781892
H  -1.353284 5.001885 0.158768
H  -4.13338 -3.27593 0.755809
H  2.853946 -2.454321 -2.043218
H  4.939003 -0.340767 1.133648
H  4.932832 -2.070146 -0.690171
