program: Gaussian 09
title: 000218119
version: EM64L-G09RevD.01
frameworkgroup: C1[X(C10H16NO3P)]
method: RPBEPBE
basis: SDD
operation: Freq
keyword: #p
keyword: freq=noraman
keyword: PBEPBE/SDD
title: #p freq=noraman PBEPBE/SDD
converged: YES YES NO NO
title: Mulliken charges:
elementType: P O O O N C C C C C C C C C C H H H H H H H H H H H H H H H H
charge: 1.376367 -0.671722 -0.687320 -0.621106 -0.826968 0.386238 -0.627263 -0.761381 -0.707757 0.485327 -0.394340 -0.395503 -0.240794 -0.241691 -0.239897 0.224098 0.240911 0.256552 0.221517 0.218150 0.232212 0.214936 0.256601 0.366085 0.244555 0.232182 0.226604 0.224798 0.228935 0.383682 0.395994
chargesum: 0.00000
title: Mulliken charges with hydrogens summed into heavy atoms:
elementType: P O O O N C C C C C C C C C C
charge: 1.376367 -0.288040 -0.291327 -0.621106 -0.460883 0.386238 -0.162253 -0.065163 -0.004009 0.485327 -0.149785 -0.163321 -0.014189 -0.016893 -0.010962
polarizability: 1.90820502e+02 2.45923516e+00 1.28071465e+02 -4.56146167e+00 -1.41288964e+01 1.11426004e+02
1716.lowfreq: -1.4629 -0.0018 -0.0011 -0.0006 5.8086 14.0137 28.9545 43.7794 52.9002
frequency: 28.7802 43.4071 52.6397 85.6100 92.5502 134.5762 175.8345 186.0558 236.1544 243.9528 251.7725 264.4878 278.9212 286.0659 307.6049 328.4511 342.5688 380.0768 392.0089 408.0091 417.1976 428.9287 446.4012 494.3468 510.2036 613.2354 618.5645 661.7889 706.6457 715.4868 724.7400 773.1061 817.1138 837.2905 858.5366 900.4700 917.9473 937.7274 961.0585 979.2629 982.5154 990.4665 995.9449 1000.7935 1015.9093 1028.8673 1054.7732 1074.5439 1080.7596 1129.4075 1172.5495 1176.9730 1191.1830 1211.2808 1222.8434 1272.2668 1312.3372 1333.0507 1374.2976 1378.1985 1385.4106 1397.8562 1441.1432 1463.4389 1469.1377 1473.8686 1482.8735 1487.7447 1493.2054 1591.6370 1613.8928 2977.0138 2979.3855 2986.6460 3042.3463 3069.9973 3086.7559 3094.5296 3100.4469 3115.6381 3120.5749 3133.4649 3144.0794 3162.1552 3559.2984 3591.8987 3602.3752
redmass: 6.7153 4.4661 4.9093 3.2198 4.3770 4.8794 3.3860 3.7446 1.3218 2.9389 2.5350 2.0688 1.2541 2.1484 1.6738 1.8730 2.8459 2.0934 2.0991 2.8363 2.2555 2.7395 2.6381 3.5305 3.2597 4.3552 6.2517 10.6547 3.0792 1.7585 12.5011 2.1998 3.5010 3.2818 1.2441 1.7642 1.4749 1.3778 2.2727 1.3832 1.8448 6.1987 1.3186 1.5539 1.4190 2.2007 1.2627 2.1910 2.5911 1.4177 1.0528 2.2500 1.1353 2.5874 2.7695 1.8647 1.4026 1.2532 1.3589 1.6871 2.6198 1.2270 2.1101 1.0587 1.0644 1.0839 1.8509 1.1818 1.0695 5.9466 6.0928 1.0472 1.0470 1.0360 1.1029 1.1002 1.1001 1.1002 1.0979 1.0864 1.0867 1.0915 1.0961 1.1015 1.0765 1.0661 1.0658
irintensity: 0.9611 0.1623 0.6755 0.0824 0.8125 0.7543 46.8216 37.7812 5.7439 6.2796 35.6333 4.0254 5.8051 5.4494 21.4083 43.0721 7.2264 19.5536 28.4767 3.0454 71.2529 26.2977 124.7970 35.3587 5.3219 0.5494 0.1622 140.1612 5.0896 119.3904 212.8924 21.3581 65.9768 26.5693 0.0238 0.4211 4.0968 0.8724 47.0629 0.2042 13.8934 0.3215 6.4306 105.4974 6.2533 4.4786 88.7324 64.2957 53.3731 16.6251 0.1874 98.1247 0.9340 83.3635 7.6116 23.0511 12.0003 2.0243 32.1855 32.3680 19.8182 10.5229 9.6839 1.8049 0.9422 0.7052 14.7009 25.2010 6.7367 1.4019 7.0944 23.9263 24.4706 11.9398 9.8547 26.8214 33.5503 8.4350 30.6262 7.4770 1.9684 13.6387 40.7714 23.2008 40.7002 46.2306 61.4585
temp: 298.150 k
press: 1.00000 atm
elementType: 15 8 8 8 7 6 6 6 6 6 6 6 6 6 6 1 1 1 1 1 1 1 1 1 1 1 1 1 1 1 1
symmnumber: 1
zpe: 651398.7 jmol-1
zpe.correction: 0.248105 hartree
zpe.thermalcorrener: 0.264896 hartree
zpe.thermalcorrenthalpy: 0.265841 hartree
zpe.thermalcorrgfe: 0.203616 hartree
zpe.sumelectzpe: -1011.158795 hartree
zpe.sumelectthermal: -1011.142003 hartree
zpe.sumelectthermalent: -1011.141059 hartree
zpe.sumelectthermalfe: -1011.203283 hartree
dipole: -0.9730 1.9296 -1.5204
dipole: 2.6423
quadrupole: -90.0233 -96.4378 -99.2230
quadrupole: 0.7019 -5.1023 1.6328
quadrupole: 5.2047 -1.2098 -3.9950 0.7019 -5.1023 1.6328
hfenergy: -1011.4068997 hartree
pointgroup: C01 [X(C10H16N1O3P1)]
dipole: -0.3422369 0.8851046 -0.424459 debye
polarizability: 191.1554373|1.8770102|133.2307593|-1.562568|-8.9211166|105.9317743 unknown
InChI: InChI=1S/C10H16NO3P/c1-10(2,11-15(12,13)14)8-9-6-4-3-5-7-9/h3-7,11-13H,8H2,1-2H3
charge 0 multiplicity 1
31 atoms
P  3.20781 -0.513402 -0.064069
O  3.743362 -0.370785 -1.727971
O  4.670023 0.07248 0.631493
O  2.652288 -1.974859 0.236564
N  2.201597 0.781521 0.388322
C  0.735043 0.697166 0.692448
C  0.015787 0.053022 -0.551423
C  0.270999 2.156521 0.906911
C  0.502125 -0.133444 1.979156
C  -1.49537 -0.085578 -0.443734
C  -2.080899 -1.26375 0.091512
C  -2.359418 0.948495 -0.892135
C  -3.483684 -1.398499 0.191586
C  -3.763266 0.819161 -0.794099
C  -4.331309 -0.355203 -0.248435
H  0.27975 0.672962 -1.429556
H  0.46082 -0.95099 -0.698602
H  -0.806393 2.178575 1.138672
H  0.810087 2.615037 1.757162
H  0.444436 2.768775 0.002445
H  -0.573073 -0.170101 2.22617
H  1.042287 0.326243 2.826207
H  0.874056 -1.164909 1.849783
H  2.666515 1.678848 0.539517
H  -1.430203 -2.082107 0.423087
H  -1.928405 1.857111 -1.331022
H  -3.914536 -2.317499 0.604987
H  -4.412001 1.627944 -1.149519
H  -5.419674 -0.459858 -0.175735
H  3.313124 -1.032233 -2.327915
H  5.48562 -0.240146 0.164689
