program: Gaussian 09
title: 000218113
version: EM64L-G09RevD.01
frameworkgroup: C1[X(C15H13N3O3)]
method: RPBEPBE
basis: SDD
operation: Freq
keyword: #p
keyword: freq=noraman
keyword: PBEPBE/SDD
title: #p freq=noraman PBEPBE/SDD
converged: YES YES NO NO
title: Mulliken charges:
elementType: O O O N N N C C C C C C C C C C C C C C C H H H H H H H H H H H H H
charge: -0.220655 -0.247647 -0.190947 -0.395759 -0.369054 -0.055072 -0.427104 0.397090 0.160313 -0.038221 0.275340 -0.496934 -0.372627 -0.368807 0.377116 -0.227898 -0.239625 -0.240597 -0.395733 -0.251770 -0.167042 0.294009 0.325468 0.294629 0.248202 0.315460 0.270029 0.266218 0.229129 0.228755 0.230525 0.275319 0.257244 0.260647
chargesum: 0.00000
title: Mulliken charges with hydrogens summed into heavy atoms:
elementType: O O O N N N C C C C C C C C C C C C C C C
charge: -0.220655 -0.247647 -0.190947 -0.070290 -0.053593 -0.055072 -0.133095 0.397090 0.160313 -0.038221 0.275340 0.045897 -0.102598 -0.102588 0.377116 0.001231 -0.010870 -0.010072 -0.120413 0.005474 0.093605
polarizability: 2.48723514e+02 -4.57491240e+00 1.60835039e+02 -5.08467108e+00 -8.07340861e+00 1.56888953e+02
1716.lowfreq: -11.3227 -3.3807 -1.9495 0.0005 0.0006 0.0009 4.5818 16.0202 22.9545
frequency: -2.1591 15.9245 22.9366 36.8346 37.9592 107.3976 118.2023 123.6428 159.1355 174.1987 191.4212 225.0964 280.4117 295.4510 319.6761 359.4468 400.1368 436.5039 452.4755 461.5229 483.5668 503.6781 532.8850 593.8938 600.6640 612.8686 628.1412 629.4556 651.3319 689.0010 700.5351 710.9926 715.6853 730.9244 743.0416 748.8367 831.4492 850.7476 855.5375 867.2597 873.3961 885.6378 892.8567 906.4144 929.1071 938.1753 978.7779 989.0203 997.1475 1000.2657 1026.2627 1030.3602 1044.4185 1062.2407 1088.8213 1132.9566 1161.0633 1169.4039 1174.4437 1197.1888 1201.3457 1211.0145 1222.2220 1236.8193 1254.1975 1270.4771 1292.9617 1332.5715 1344.8741 1363.8793 1378.4371 1401.7500 1436.4816 1448.0129 1482.1567 1487.0528 1513.2924 1570.3702 1590.8311 1597.7167 1607.7561 1636.4935 1646.6832 3014.8369 3050.6821 3099.3547 3125.4177 3133.0843 3144.3076 3153.9362 3166.4531 3222.1915 3236.5548 3268.5415 3502.8270 3559.5294
redmass: 5.2110 3.8909 6.3370 5.3468 5.3211 6.0310 9.2906 6.7986 5.9739 7.0171 5.9257 5.4113 4.7144 4.4793 2.7665 6.6981 2.8336 2.0093 3.0199 4.1316 3.5479 6.2120 3.8111 3.2775 6.0990 4.7795 2.9079 2.8183 3.1775 7.0408 2.3015 6.5863 3.0281 1.3388 2.7789 2.1978 1.3155 1.7272 2.1320 4.6435 4.5674 1.4836 4.5607 3.0512 1.6706 2.3456 1.3992 5.7773 1.3256 2.7872 1.9172 2.2595 3.3344 4.4171 1.6485 1.5235 2.6039 2.9035 1.0640 3.2151 1.1599 1.4378 1.8006 1.6106 1.7414 1.4529 3.6415 1.3121 1.3105 2.3827 7.3629 1.9240 2.2345 1.1011 2.1244 5.0104 2.0693 8.9945 6.0441 6.9136 5.8978 6.3680 8.4926 1.0645 1.0837 1.0983 1.0848 1.0882 1.0928 1.0960 1.1016 1.0922 1.0994 1.1086 1.0774 1.0780
irintensity: 1.1606 0.0821 1.7727 1.8759 0.6463 2.5916 6.0765 0.7198 3.1471 8.6186 2.7524 2.3255 0.2894 2.1533 10.2143 8.1642 0.0543 27.0522 7.0213 2.6920 20.3616 9.4132 43.3850 6.9299 1.4307 14.6780 63.7187 40.9578 46.1037 11.2900 55.1025 0.4949 24.6959 76.6935 54.8711 52.9456 32.2315 5.2917 3.7713 14.6863 4.5486 5.2174 9.3720 4.8491 1.7871 3.1079 0.3651 2.9849 0.2115 16.9122 12.7207 21.3861 0.6333 58.3083 11.2437 20.5851 10.6674 3.7498 0.3596 20.8109 17.0534 77.5952 11.4486 122.0042 70.0239 60.4030 206.7604 4.7623 19.8026 3.2672 0.2109 76.1994 13.8013 28.5110 37.8965 10.4506 229.7671 957.9712 6.1743 0.4845 17.3269 276.4242 215.6509 25.7031 0.4623 11.7732 0.3318 4.9406 12.2260 22.1186 21.9380 3.4187 0.1200 0.3383 20.9696 67.3509
temp: 298.150 k
press: 1.00000 atm
elementType: 8 8 8 7 7 7 6 6 6 6 6 6 6 6 6 6 6 6 6 6 6 1 1 1 1 1 1 1 1 1 1 1 1 1
symmnumber: 1
zpe: 673389.5 jmol-1
zpe.correction: 0.256481 hartree
zpe.thermalcorrener: 0.273458 hartree
zpe.thermalcorrenthalpy: 0.274403 hartree
zpe.thermalcorrgfe: 0.208710 hartree
zpe.sumelectzpe: -967.832400 hartree
zpe.sumelectthermal: -967.815422 hartree
zpe.sumelectthermalent: -967.814478 hartree
zpe.sumelectthermalfe: -967.880170 hartree
dipole: -3.8778 -0.1026 -5.0050
dipole: 6.3323
quadrupole: -101.0133 -124.2788 -127.9202
quadrupole: -9.3462 -5.4371 1.8193
quadrupole: 16.7242 -6.5414 -10.1828 -9.3462 -5.4371 1.8193
hfenergy: -968.0888803 hartree
pointgroup: C01[X(C15H13N3O3)]
dipole: 1.4094707 -1.8339495 -0.9255829 debye
polarizability: 249.1462444|-1.205333|163.6463409|1.7245771|-6.9535035|153.6549201 unknown
InChI: InChI=1S/C15H13N3O3/c19-13-12(10-5-2-1-3-6-10)14(20)18-15(17-13)16-9-11-7-4-8-21-11/h1-8,12,16-17H,9H2
charge 0 multiplicity 1
34 atoms
O  -1.692424 -1.340026 2.859739
O  4.749263 -1.2890 -0.881188
O  -0.749938 2.843513 0.935038
N  -0.03792 -1.114226 1.24995
N  1.660176 -0.933215 -0.376671
N  0.413923 0.985872 0.139747
C  -1.746812 0.664444 1.408091
C  -2.854411 0.361244 0.362484
C  -1.186111 -0.660304 1.930414
C  -0.647235 1.592255 0.832711
C  0.659352 -0.30644 0.322947
C  2.567482 -0.18961 -1.283738
C  -3.919061 -0.50631 0.719971
C  -2.850585 0.95926 -0.921561
C  3.969221 -0.108798 -0.765602
C  -4.958932 -0.775161 -0.196007
C  -3.893413 0.686447 -1.836493
C  -4.949453 -0.181158 -1.479654
C  4.720672 0.876184 -0.147938
C  6.024951 0.310477 0.136652
C  6.005298 -0.996536 -0.316308
H  -2.214212 1.181401 2.264244
H  0.321108 -2.03078 1.535438
H  2.144261 0.823024 -1.376551
H  2.549841 -0.674583 -2.277046
H  1.84906 -1.925314 -0.225511
H  -3.929706 -0.969195 1.713452
H  -2.051186 1.650757 -1.207406
H  -5.776581 -1.444349 0.094304
H  -3.881292 1.159271 -2.824897
H  -5.757742 -0.38806 -2.18985
H  4.379439 1.884355 0.079115
H  6.863994 0.813294 0.613147
H  6.729976 -1.805634 -0.333125
