program: Gaussian 09
title: 000218112
version: EM64L-G09RevD.01
frameworkgroup: C1[X(C12H13N3O3)]
method: RPBEPBE
basis: SDD
operation: Freq
keyword: #p
keyword: freq=noraman
keyword: PBEPBE/SDD
title: #p freq=noraman PBEPBE/SDD
converged: YES YES NO NO
title: Mulliken charges:
elementType: O O O N N N C C C C C C C C C C C C H H H H H H H H H H H H H
charge: -0.246395 -0.216980 -0.210077 -0.405052 -0.357341 -0.042180 -0.319765 -0.493324 0.146546 0.011452 0.265961 -0.507257 -0.030060 0.374755 -0.383004 -0.254602 -0.168181 -0.566541 0.285307 0.252424 0.238536 0.323004 0.287408 0.245426 0.307738 0.219798 0.283476 0.256133 0.259363 0.214820 0.228612
chargesum: 0.00000
title: Mulliken charges with hydrogens summed into heavy atoms:
elementType: O O O N N N C C C C C C C C C C C C
charge: -0.246395 -0.216980 -0.210077 -0.082048 -0.049602 -0.042180 -0.034458 -0.002364 0.146546 0.011452 0.265961 0.025577 0.189738 0.374755 -0.099528 0.001531 0.091182 -0.123110
polarizability: 1.92075019e+02 1.21938135e+01 1.48590055e+02 7.49933195e+00 7.81910140e+00 1.30363878e+02
1716.lowfreq: -20.0559 -9.9783 0.0004 0.0006 0.0007 5.7826 6.7746 18.8884 33.3608
frequency: -16.7498 18.7078 33.3271 35.8628 55.1760 58.2021 112.8985 145.5524 162.2273 170.8030 202.2528 231.4134 277.9092 327.3519 341.0608 373.9081 412.6578 428.3523 465.0948 482.1138 491.2889 588.6914 594.3851 605.7008 619.5740 630.3144 667.2943 687.1596 707.1051 727.9492 737.1753 771.0232 816.8106 835.6796 847.3279 869.0653 875.2508 888.8475 918.1440 933.0715 945.0820 957.1940 998.3201 1002.7597 1010.2078 1023.2597 1043.2865 1063.2013 1114.1660 1132.7352 1159.7277 1176.7008 1208.4286 1221.9122 1232.7196 1256.1638 1278.8962 1283.7051 1288.3836 1293.2775 1322.2787 1353.0948 1367.0081 1408.6897 1423.9223 1433.8511 1457.1792 1484.3321 1512.3545 1562.7846 1594.7054 1632.0736 1646.0353 1659.5274 3002.2719 3024.4456 3030.9011 3069.8609 3084.7351 3097.7365 3110.0974 3198.9557 3222.4488 3237.5436 3267.6296 3497.4900 3559.2605
redmass: 5.0297 5.4896 5.9750 4.7451 3.0549 3.8976 7.1077 4.7850 4.3862 5.4355 5.1056 3.3950 3.8197 2.3786 2.9077 6.2950 1.8549 1.5262 4.8749 9.3066 4.0275 4.7178 3.1247 2.1582 3.2109 3.6811 2.0767 8.8368 2.7402 1.6385 2.6151 3.6704 3.6942 1.3177 2.3874 5.6987 3.8931 1.3920 2.5157 2.8539 1.8467 1.3710 1.9560 1.3283 3.5267 1.7525 3.2645 4.2294 1.8793 1.5194 1.5544 1.6871 2.4737 1.6937 1.5961 1.8551 1.6904 1.8832 1.2620 2.1197 1.5115 1.3376 2.1173 1.8701 1.1550 1.1245 1.1323 4.9897 2.0218 9.3564 6.8452 6.8888 7.1480 4.6780 1.0611 1.0818 1.0630 1.0915 1.0799 1.0834 1.1003 1.1151 1.0918 1.0997 1.1086 1.0771 1.0780
irintensity: 1.4738 3.1097 1.3026 1.0819 1.6293 0.3884 8.2836 0.3579 0.6980 7.2410 2.5989 4.1907 0.1704 8.0592 3.1609 12.2171 8.2606 32.5928 14.1042 11.0341 23.9023 14.8608 4.0860 9.3906 44.2702 1.8544 103.7092 1.3730 38.8642 48.7004 64.8036 22.8649 3.8450 29.0470 3.2533 6.8116 6.6000 4.0354 6.7824 0.7692 8.1001 83.0646 22.2311 12.0625 15.8386 19.6401 0.9439 51.2098 2.4027 20.4920 16.6258 35.4289 10.2992 6.2908 151.9736 80.6073 3.0836 8.6885 16.0835 175.7608 59.9541 18.6076 4.9300 87.5742 13.5278 20.9290 37.1852 10.4592 255.3052 856.0343 0.0808 202.4876 267.4794 11.0599 19.0747 4.5678 26.1947 1.8427 14.3233 6.6806 3.8300 19.5580 3.1644 0.2455 0.4936 19.8881 59.2555
temp: 298.150 k
press: 1.00000 atm
elementType: 8 8 8 7 7 7 6 6 6 6 6 6 6 6 6 6 6 6 1 1 1 1 1 1 1 1 1 1 1 1 1
symmnumber: 1
zpe: 622644.7 jmol-1
zpe.correction: 0.237153 hartree
zpe.thermalcorrener: 0.253234 hartree
zpe.thermalcorrenthalpy: 0.254178 hartree
zpe.thermalcorrgfe: 0.190792 hartree
zpe.sumelectzpe: -853.659510 hartree
zpe.sumelectthermal: -853.643429 hartree
zpe.sumelectthermalent: -853.642485 hartree
zpe.sumelectthermalfe: -853.705871 hartree
dipole: 3.6582 3.1031 2.6568
dipole: 5.4836
quadrupole: -101.0238 -113.6056 -100.7006
quadrupole: 5.8866 -6.1734 2.5165
quadrupole: 4.0862 -8.4956 4.4094 5.8866 -6.1734 2.5165
hfenergy: -853.8966631 hartree
pointgroup: C01 [X(C12H13N3O3)]
dipole: -1.3658704 -0.9395333 1.3806476 debye
polarizability: 190.7256569|7.855222|144.1902671|-14.7972955|-11.0339992|136.1130285 unknown
InChI: InChI=1S/C12H13N3O3/c1-2-4-9-10(16)14-12(15-11(9)17)13-7-8-5-3-6-18-8/h2-3,5-6,9,13-14H,1,4,7H2
charge 0 multiplicity 1
31 atoms
O  -4.161889 -0.387691 1.103186
O  2.575869 -2.861106 -0.724697
O  1.546241 1.717599 -1.940166
N  0.839935 -1.670897 0.238881
N  -0.954612 -0.551492 1.278961
N  0.28634 0.624767 -0.317705
C  2.352024 -0.486159 -1.334136
C  3.788372 -0.024991 -0.876611
C  1.95827 -1.769684 -0.612015
C  1.356959 0.697802 -1.221992
C  0.073294 -0.490671 0.369598
C  -1.903495 0.577836 1.445199
C  3.889063 0.264056 0.606612
C  -3.132965 0.450244 0.599751
C  -3.511543 0.94946 -0.634819
C  -4.828041 0.418765 -0.928906
C  -5.187831 -0.384042 0.13935
C  4.065242 1.498825 1.139639
H  2.441652 -0.737127 -2.408262
H  4.032582 0.874824 -1.467429
H  4.492085 -0.832602 -1.154326
H  0.591247 -2.526448 0.746424
H  -1.359047 1.489289 1.154457
H  -2.174282 0.640864 2.513935
H  -1.181275 -1.434154 1.739545
H  3.825829 -0.607351 1.27739
H  -2.909805 1.608063 -1.258061
H  -5.425968 0.612694 -1.817084
H  -6.064436 -0.978243 0.381605
H  4.139514 1.652771 2.222294
H  4.13377 2.391199 0.505579
