program: Gaussian 09
title: 000218111
version: EM64L-G09RevD.01
frameworkgroup: C1[X(C11H13N3O3)]
method: RPBEPBE
basis: SDD
operation: Freq
keyword: #p
keyword: freq=noraman
keyword: PBEPBE/SDD
title: #p freq=noraman PBEPBE/SDD
converged: YES YES NO NO
title: Mulliken charges:
elementType: O O O N N N C C C C C C C C C C C H H H H H H H H H H H H H
charge: -0.216357 -0.206223 -0.246914 -0.403058 -0.360536 -0.049293 -0.305054 -0.389903 0.142906 -0.009246 0.265544 -0.693806 -0.506082 0.376604 -0.386691 -0.253519 -0.167810 0.282950 0.246119 0.235905 0.321794 0.238793 0.218071 0.224626 0.289024 0.245902 0.309229 0.280941 0.256410 0.259671
chargesum: 0.00000
title: Mulliken charges with hydrogens summed into heavy atoms:
elementType: O O O N N N C C C C C C C C C C C
charge: -0.216357 -0.206223 -0.246914 -0.081264 -0.051307 -0.049293 -0.022104 0.092121 0.142906 -0.009246 0.265544 -0.012316 0.028845 0.376604 -0.105750 0.002891 0.091861
polarizability: 1.92727399e+02 1.27155324e+01 1.42940431e+02 -2.97599730e+00 -7.08610817e+00 1.08387112e+02
1716.lowfreq: -10.2853 -0.0004 -0.0003 0.0007 5.1113 7.5720 17.1155 29.9648 36.6736
frequency: 15.5701 29.7159 36.6402 37.8451 83.9913 112.8713 142.3048 166.2187 175.6148 203.0207 205.7498 279.4732 287.1748 326.9584 366.2258 389.0009 430.4561 462.9431 481.0975 501.2565 592.0559 594.8126 621.1606 622.1623 647.1781 688.4883 705.5299 721.3052 729.6631 744.2825 780.6020 832.2555 838.2789 867.5731 873.8376 887.8785 897.3565 907.4471 934.2130 993.8369 1020.7160 1037.5506 1044.8139 1057.2545 1081.3481 1106.4336 1133.1733 1171.0388 1202.2422 1213.5182 1222.5940 1243.1663 1258.9367 1278.5185 1291.3324 1299.4280 1340.4598 1350.4984 1366.7161 1397.1774 1407.6761 1437.3907 1458.4666 1480.7090 1484.3987 1486.0503 1513.5913 1562.4495 1596.1549 1631.2445 1647.7820 2980.0923 3007.8221 3027.4112 3029.8246 3059.6196 3080.2365 3086.9415 3107.7683 3222.7570 3237.6555 3268.7056 3497.4998 3559.5147
redmass: 5.1732 4.3041 6.0325 4.8468 2.7509 7.4323 5.6071 5.1230 5.1110 4.4789 1.5492 3.7362 1.5762 2.4649 5.6582 4.0481 1.4290 4.8008 8.9406 4.0042 6.1163 3.2779 3.9005 2.3382 2.5294 8.4774 2.6534 3.6443 1.3968 3.7781 1.4133 1.6751 2.6150 4.5026 4.4783 1.4009 2.8627 2.5490 2.5833 2.8219 1.6461 1.8635 3.0653 3.2400 3.4712 1.6945 1.5356 2.2326 1.4504 3.5427 1.6653 1.6866 1.5562 1.6975 2.5564 1.4653 1.4371 1.3131 2.2382 1.2175 1.9014 1.1242 1.0871 1.0501 1.0444 5.0049 2.0034 8.8993 6.8873 6.8686 7.1994 1.0362 1.0609 1.0633 1.0819 1.1010 1.0991 1.1030 1.0998 1.0920 1.0997 1.1086 1.0771 1.0780
irintensity: 2.2189 2.7640 1.1003 1.5224 0.6123 7.8257 0.7344 1.8193 7.3072 2.4054 2.8132 0.0957 1.4019 8.6180 13.7764 1.0019 33.6813 16.1276 11.3132 23.5167 9.5805 2.5880 31.1331 47.3939 56.4158 3.1788 34.3615 7.0205 61.7133 80.1559 8.6722 29.9594 6.8965 11.1701 3.3842 4.1233 1.8035 15.8751 1.6845 19.4930 19.5872 17.8501 6.0431 14.3196 27.0082 0.3674 20.4648 6.3334 84.9189 38.3290 15.3064 162.3070 21.7353 6.4381 212.3065 23.9165 15.8965 17.6879 4.5374 13.9444 92.2283 22.1572 31.5685 12.5892 18.8638 9.6778 252.2991 877.7809 0.1491 205.8402 258.3262 19.3444 20.8584 27.7275 4.6641 4.1950 39.0227 31.9333 5.5919 3.2164 0.2022 0.4354 19.4754 59.2075
temp: 298.150 k
press: 1.00000 atm
elementType: 8 8 8 7 7 7 6 6 6 6 6 6 6 6 6 6 6 1 1 1 1 1 1 1 1 1 1 1 1 1
symmnumber: 1
zpe: 611308.0 jmol-1
zpe.correction: 0.232835 hartree
zpe.thermalcorrener: 0.248860 hartree
zpe.thermalcorrenthalpy: 0.249805 hartree
zpe.thermalcorrgfe: 0.186346 hartree
zpe.sumelectzpe: -815.638727 hartree
zpe.sumelectthermal: -815.622702 hartree
zpe.sumelectthermalent: -815.621757 hartree
zpe.sumelectthermalfe: -815.685216 hartree
dipole: -3.5994 -3.7982 1.6571
dipole: 5.4889
quadrupole: -94.3773 -108.2633 -98.3967
quadrupole: 3.0865 9.2789 -5.0258
quadrupole: 5.9685 -7.9175 1.9491 3.0865 9.2789 -5.0258
hfenergy: -815.871562 hartree
pointgroup: C01 [X(C11H13N3O3)]
dipole: -1.3721382 -1.1051092 1.2487758 debye
polarizability: 191.840298|6.9076124|133.1306874|-13.8794946|-16.9839943|119.0839564 unknown
InChI: InChI=1S/C11H13N3O3/c1-2-8-9(15)13-11(14-10(8)16)12-6-7-4-3-5-17-7/h3-5,8,12-13H,2,6H2,1H3
charge 0 multiplicity 1
30 atoms
O  2.936337 -2.609451 -0.902624
O  1.889142 2.061785 -1.600894
O  -3.933689 -0.561568 0.931764
N  1.118362 -1.576638 0.089386
N  -0.750133 -0.618845 1.160351
N  0.574664 0.771416 -0.178739
C  2.734754 -0.16949 -1.166447
C  4.084208 0.242247 -0.477306
C  2.30156 -1.546006 -0.677858
C  1.692787 0.965696 -1.007873
C  0.331495 -0.429211 0.334317
C  3.977522 0.430859 1.049941
C  -1.730356 0.466115 1.413812
C  -2.945442 0.38002 0.543033
C  -3.342544 1.003524 -0.627424
C  -4.628963 0.4471 -0.997509
C  -4.953216 -0.494286 -0.036625
H  2.954401 -0.265237 -2.246398
H  4.406118 1.184863 -0.955474
H  4.832216 -0.536094 -0.715589
H  0.839119 -2.499345 0.438744
H  3.250285 1.221103 1.310607
H  3.673083 -0.5036 1.557414
H  4.956798 0.72803 1.465358
H  -1.205611 1.412585 1.21148
H  -2.015289 0.429554 2.48042
H  -0.9838 -1.555544 1.492956
H  -2.773257 1.761821 -1.161324
H  -5.231076 0.715554 -1.863094
H  -5.799574 -1.156253 0.122894
