program: Gaussian 09
title: 000218101
version: EM64L-G09RevD.01
frameworkgroup: C1[X(C23H29ClN2O2S)]
method: RPBEPBE
basis: SDD
operation: Freq
keyword: #p
keyword: freq=noraman
keyword: PBEPBE/SDD
title: #p freq=noraman PBEPBE/SDD
converged: YES YES NO NO
title: Mulliken charges:
elementType: Cl S O O N N C C C C C C C C C C C C C C C C C C C C C C C H H H H H H H H H H H H H H H H H H H H H H H H H H H H H
charge: -0.068114 0.235611 -0.305701 -0.446294 -0.075357 -0.280966 0.047443 -0.381340 -0.381678 -0.360015 -0.456993 -0.432392 -0.048001 -0.461217 -0.716579 0.543229 0.491953 -0.249586 -0.401335 -0.349924 -0.273450 -0.331654 -0.327627 -0.251337 -0.264941 -0.121781 -0.238829 -0.274936 -0.252067 0.177596 0.221507 0.175543 0.169530 0.217415 0.178371 0.200885 0.224733 0.207691 0.199129 0.220725 0.243593 0.209260 0.225868 0.188787 0.243538 0.237808 0.199460 0.189110 0.277418 0.242804 0.201597 0.207416 0.253081 0.248473 0.228886 0.260363 0.233724 0.349566
chargesum: 0.00000
title: Mulliken charges with hydrogens summed into heavy atoms:
elementType: Cl S O O N N C C C C C C C C C C C C C C C C C C C C C C C
charge: -0.068114 0.235611 -0.305701 -0.096728 -0.075357 -0.280966 0.225039 0.015710 0.005267 0.019241 -0.024569 -0.012538 0.195591 -0.026088 -0.046446 0.543229 0.491953 0.138984 -0.401335 -0.349924 0.003968 -0.088850 0.081387 0.001744 -0.016468 -0.121781 -0.009943 -0.014574 -0.018343
polarizability: 3.48581114e+02 5.78084528e+01 3.29527893e+02 -3.18867172e+01 1.89180214e+01 2.26794413e+02
1716.lowfreq: -3.4766 -0.0024 -0.0021 -0.0020 3.1301 5.8333 11.3856 14.1622 20.6822
frequency: 11.0025 14.1005 20.6334 34.7598 39.9824 43.1678 57.0382 61.0841 79.2618 91.9098 113.7646 119.5175 125.0524 153.4486 162.3776 167.3686 194.1124 214.1228 224.5344 230.6070 248.7699 254.1187 267.0380 285.6050 298.9816 318.0688 333.8210 348.0342 354.8828 358.3829 371.5602 412.5691 416.6986 422.7103 438.2508 442.7561 455.3815 473.7127 478.5362 485.2304 494.1851 527.3119 540.9437 547.2409 572.0188 597.1301 614.3639 634.2555 669.3697 683.0496 710.3217 725.4694 752.1889 757.4369 786.0399 800.1614 813.9834 821.9493 836.2479 847.6028 851.7656 854.1590 874.3096 875.1126 901.8735 928.7524 931.8573 936.7690 942.5856 947.3183 959.5631 972.5895 988.3768 998.2402 1020.8618 1025.3176 1030.3215 1039.2153 1043.0889 1061.1580 1082.5546 1089.0381 1092.3928 1097.3636 1112.4549 1123.2170 1125.3616 1129.2551 1137.4014 1142.4250 1143.3185 1148.9346 1175.8450 1181.4995 1192.9773 1207.1459 1219.9749 1238.8922 1243.2114 1256.0504 1259.7631 1274.6790 1279.8707 1283.7974 1286.5496 1304.4692 1312.8220 1318.1448 1328.0317 1330.9556 1343.7843 1348.5751 1352.5741 1358.9516 1367.9820 1372.2648 1379.8335 1380.9143 1382.0541 1384.9022 1395.5739 1406.4733 1428.8216 1450.8698 1454.1806 1459.0792 1461.2340 1463.5142 1466.7020 1468.7584 1472.8116 1474.3066 1478.8667 1480.8233 1488.9827 1556.5378 1578.6413 1580.9853 1609.5407 2811.4112 2816.1081 2831.0986 2907.0053 2928.7335 2941.8828 2966.0900 2973.5090 2988.1802 2995.1325 3005.9868 3007.0000 3007.7440 3030.5866 3045.6018 3058.2183 3062.6311 3071.4117 3073.8470 3079.2209 3097.2465 3133.7176 3143.2745 3150.4277 3157.0646 3171.6121 3176.1313 3183.5136 3527.0002
redmass: 6.0399 4.7128 3.8721 5.6696 5.6412 5.0124 5.1312 3.3857 3.3771 6.3408 4.6380 4.0983 4.6869 4.6202 3.5845 2.9967 5.0252 1.2585 3.6798 1.8918 2.8470 3.8800 3.7992 4.8434 5.0505 3.6939 2.6396 2.8889 3.0489 4.9557 5.5820 3.7129 3.2348 2.7631 3.5301 3.0403 1.9205 4.6910 3.1801 1.4903 2.4722 4.0702 3.9115 4.0637 5.8887 4.4554 3.6838 3.4711 6.2095 5.8690 4.8734 3.5924 1.4446 3.3800 4.9865 1.3402 1.5188 2.0512 2.5710 1.4539 2.0160 1.5446 2.4309 2.7182 1.5318 1.4050 1.3425 2.1163 1.5908 1.7160 2.2283 1.3140 1.6441 2.3708 6.1089 4.5044 4.3456 2.3259 2.2558 4.4551 2.7156 2.5472 1.9697 2.0995 2.8000 2.1013 1.6089 2.2360 1.6406 1.7260 1.5595 1.9805 1.0754 1.5928 1.3515 1.2143 1.3266 1.5380 1.8836 1.3625 1.4570 1.3507 1.5865 1.4230 1.3255 1.2296 1.4325 1.7881 1.2080 1.3327 1.4489 1.4716 1.3848 1.5499 1.3679 5.5039 1.5442 5.1972 1.2977 1.3314 1.4802 2.4282 2.3327 1.0904 2.7252 1.0881 1.0825 1.0914 1.0930 1.0833 1.1818 1.5866 1.1871 1.1006 1.1616 6.6150 6.6795 7.5010 7.4057 1.0702 1.0720 1.0695 1.0828 1.0694 1.0552 1.0701 1.0397 1.0826 1.0619 1.0791 1.1006 1.0680 1.0866 1.0868 1.0911 1.1031 1.0954 1.1032 1.0964 1.1001 1.0851 1.0899 1.0898 1.0939 1.1007 1.0914 1.0961 1.0649
irintensity: 0.2688 0.5579 0.1816 0.8486 0.7745 1.0245 0.6284 0.2292 0.6659 1.1948 1.7129 0.2618 0.7844 2.2520 4.5446 0.7685 0.8451 0.1073 1.8729 0.3727 8.0733 5.0007 3.7177 0.9252 0.3284 0.2829 0.1002 2.1648 3.6242 5.5881 2.6079 0.6820 7.3516 4.6100 10.0159 2.4154 23.5883 16.5063 5.0482 98.1348 68.3971 1.0621 0.2561 4.3982 8.3294 4.2335 4.3064 8.5703 2.3666 2.3461 1.2810 9.6748 77.7594 11.2558 26.7756 36.6262 2.0588 4.1130 1.4281 2.5182 25.7051 22.7523 34.9963 22.2739 1.4205 4.5507 0.5878 9.3065 7.2748 45.9226 23.9687 0.0116 8.4233 15.4118 22.2525 113.2819 59.6365 19.9436 7.2750 186.4064 11.5207 37.2985 11.1650 22.2454 10.3962 12.4166 18.5011 6.1569 28.5809 3.4410 8.9420 0.8860 0.5108 10.9035 8.8561 16.7578 19.8505 35.0690 49.2474 3.5040 17.5550 0.7781 2.0009 14.5779 16.5779 9.8181 39.0114 43.4614 25.4713 17.0906 34.1235 12.1543 0.2689 8.3817 7.9358 16.1864 4.2511 8.3410 32.3229 19.3018 15.0815 21.8446 7.1442 6.0224 331.0357 7.2288 7.6924 3.6234 13.9817 4.9861 4.0483 28.7916 3.9311 16.6316 10.7952 37.1836 3.4130 68.4170 42.4526 53.3094 32.0055 204.9760 57.1209 59.1615 50.4204 38.8592 17.6938 1.9423 22.9217 39.5512 90.1465 4.7535 50.9789 33.4711 13.5698 27.2299 42.2340 39.1670 41.9447 20.3535 2.3473 6.8851 2.8890 22.7824 22.3965 3.2815 1.1458 10.1372
temp: 298.150 k
press: 1.00000 atm
elementType: 17 16 8 8 7 7 6 6 6 6 6 6 6 6 6 6 6 6 6 6 6 6 6 6 6 6 6 6 6 1 1 1 1 1 1 1 1 1 1 1 1 1 1 1 1 1 1 1 1 1 1 1 1 1 1 1 1 1
symmnumber: 1
zpe: 1249175.2 jmol-1
zpe.correction: 0.475786 hartree
zpe.thermalcorrener: 0.504203 hartree
zpe.thermalcorrenthalpy: 0.505148 hartree
zpe.thermalcorrgfe: 0.412941 hartree
zpe.sumelectzpe: -2009.711425 hartree
zpe.sumelectthermal: -2009.683007 hartree
zpe.sumelectthermalent: -2009.682063 hartree
zpe.sumelectthermalfe: -2009.774269 hartree
dipole: -1.8156 -4.3940 -2.2112
dipole: 5.2434
quadrupole: -208.9076 -184.2704 -187.6194
quadrupole: -16.5553 -7.9622 10.9394
quadrupole: -15.3085 9.3287 5.9797 -16.5553 -7.9622 10.9394
hfenergy: -2010.1872102 hartree
pointgroup: C01 [X(C23H29Cl1N2O2S1)]
dipole: -0.7285527 1.7117248 0.8915361 debye
polarizability: 348.5705666|-58.3852271|328.4150102|31.8384924|20.206724|227.9178441 unknown
InChI: InChI=1S/C23H29ClN2O2S/c1-17(15-25-10-8-19(9-11-25)28-13-12-27)16-26-20-4-2-3-5-22(20)29-23-7-6-18(24)14-21(23)26/h2-7,14,17,19,27H,8-13,15-16H2,1H3
charge 0 multiplicity 1
58 atoms
Cl -0.858302 -4.480357 1.375118
S  -4.379376 -0.332005 -2.079244
O  6.436231 0.092593 -0.619227
O  8.820642 -1.395198 -0.631963
N  2.407401 1.060627 0.400606
N  -2.597883 0.366784 0.308693
C  5.256832 0.355313 0.225818
C  2.846505 -0.352245 0.528345
C  3.447958 1.990362 0.90511
C  1.080982 1.31112 1.011739
C  4.154472 -0.601517 -0.249596
C  4.770401 1.816124 0.127782
C  -0.099718 0.772724 0.161109
C  -1.407374 0.935791 0.982959
C  -0.190083 1.491468 -1.199727
C  -2.628147 -1.025022 0.011144
C  -3.813214 1.123009 0.264174
C  7.678112 0.738088 -0.15855
C  -3.466749 -1.524837 -1.025711
C  -4.772139 0.884577 -0.758809
C  -1.845928 -1.955395 0.749839
C  -4.115193 2.108886 1.242713
C  8.805874 0.040173 -0.922789
C  -3.538254 -2.90346 -1.301631
C  -5.981264 1.604684 -0.811379
C  -1.904367 -3.321041 0.424202
C  -5.308607 2.859572 1.168489
C  -2.738435 -3.826993 -0.587946
C  -6.247556 2.613975 0.142774
H  5.518122 0.128374 1.287402
H  2.05716 -1.014569 0.132356
H  2.994668 -0.627191 1.607707
H  3.641213 1.833082 2.000891
H  3.080904 3.02614 0.784243
H  1.022942 0.88003 2.047686
H  0.960908 2.408495 1.116483
H  3.982286 -0.43363 -1.32836
H  4.480309 -1.648995 -0.112782
H  5.525954 2.515633 0.533802
H  4.604132 2.062665 -0.937302
H  0.066037 -0.30567 -0.027124
H  -1.277798 0.510646 2.003279
H  -1.590513 2.017122 1.106175
H  -0.416876 2.567342 -1.062532
H  0.77584 1.411176 -1.726856
H  -0.983897 1.05548 -1.831128
H  7.797227 0.58221 0.935633
H  7.668295 1.827187 -0.374014
H  -1.211533 -1.62188 1.573881
H  -3.427791 2.280932 2.076332
H  8.679773 0.22362 -2.010749
H  9.787923 0.428341 -0.60414
H  -4.204529 -3.261445 -2.092928
H  -6.703528 1.385387 -1.604865
H  -5.509994 3.623379 1.927388
H  -2.766536 -4.894813 -0.817444
H  -7.177491 3.188608 0.087526
H  7.883471 -1.705154 -0.745199
