program: Gaussian 09
title: 000218084
version: EM64L-G09RevD.01
frameworkgroup: C1[X(C13H13N5O4S)]
method: RPBEPBE
basis: SDD
operation: Freq
keyword: #p
keyword: freq=noraman
keyword: PBEPBE/SDD
title: #p freq=noraman PBEPBE/SDD
converged: YES YES NO NO
title: Mulliken charges:
elementType: S O O O O N N N N N C C C C C C C C C C C C C H H H H H H H H H H H H H
charge: 0.238493 -0.233843 -0.225884 -0.209706 -0.242622 -0.056841 0.033736 -0.398140 0.046298 -0.645028 -0.380631 0.295732 -0.211322 0.147211 -0.739536 -0.172348 0.408760 -0.322051 -0.805173 -0.363608 0.268945 -0.307330 0.304876 0.232870 0.252249 0.253127 0.278950 0.284982 0.243389 0.272075 0.240818 0.271710 0.293183 0.290784 0.305210 0.350663
chargesum: 0.00000
title: Mulliken charges with hydrogens summed into heavy atoms:
elementType: S O O O O N N N N N C C C C C C C C C C C C C
charge: 0.238493 -0.233843 -0.225884 -0.209706 -0.242622 -0.056841 0.033736 -0.107356 0.046298 0.010845 -0.380631 0.295732 -0.211322 0.147211 -0.001290 0.106602 0.408760 -0.037069 -0.048891 -0.091898 0.268945 -0.014147 0.304876
polarizability: 8.24828434e+02 1.54427425e+01 2.28534927e+02 2.40631170e-02 -7.38677576e-02 8.82713673e+01
1716.lowfreq: -1.9819 0.0003 0.0010 0.0015 0.7438 4.5924 16.3108 28.3919 31.0703
frequency: 16.1931 28.3900 31.0590 38.8367 43.2979 62.0974 64.3860 91.5259 113.8197 114.7932 127.1815 149.6788 160.2779 171.4113 189.3589 205.6746 221.8737 242.4730 266.5468 283.0257 304.6373 319.7713 338.1667 341.8511 394.8470 400.1262 426.4488 472.0170 486.5816 491.8981 508.5573 521.5361 542.1382 558.9694 568.0189 598.7496 611.8617 632.5111 657.6033 666.3557 668.5226 673.7463 700.1091 710.1283 730.1615 804.2653 816.0008 879.7163 904.1965 904.4637 915.6069 921.6930 955.7376 963.2975 966.1939 984.7446 1026.0419 1030.0467 1034.3417 1037.0549 1051.7757 1094.8337 1126.9832 1154.7969 1178.9328 1226.0083 1260.2924 1284.8563 1289.0427 1293.1155 1300.4520 1336.2587 1354.1611 1373.3390 1399.6598 1402.6906 1421.4075 1448.1485 1449.9391 1454.7560 1466.3428 1479.4116 1501.4094 1515.2951 1523.0184 1545.4420 1606.4392 1613.9119 1683.7574 2963.1677 3001.9935 3035.3380 3078.4845 3110.7820 3122.4575 3142.2205 3154.1640 3230.0247 3258.8225 3405.4571 3537.6507 3692.9089
redmass: 8.2098 8.5644 5.2190 4.8558 4.7037 8.4839 7.2233 4.1123 3.7687 4.1255 1.4289 1.2252 5.0175 7.7515 4.4223 6.7370 3.0278 5.1388 1.8964 4.6493 1.8643 4.0905 4.6367 3.9891 4.0043 7.5961 7.1982 6.1358 3.5860 1.6209 1.3713 5.7686 5.8316 5.2510 2.6299 2.8896 5.4907 6.6269 4.5594 7.3539 5.7376 7.9620 4.2253 8.5326 11.6210 1.3150 4.7365 1.8527 9.2508 1.3936 3.3885 6.2486 3.9993 1.0975 3.0807 2.1788 1.2571 1.5318 1.5207 2.1732 2.4715 3.2395 4.2779 5.0373 1.9615 3.8348 1.6402 3.3391 2.5287 3.5816 2.6190 10.3541 4.7849 3.6667 1.2252 1.2635 4.3711 1.0467 1.3222 1.1710 4.5508 1.0465 6.4040 1.7760 7.5175 6.7832 1.2298 5.6897 5.1903 1.0407 1.0369 1.0981 1.0952 1.0944 1.1018 1.0945 1.0880 1.0958 1.1032 1.0747 1.0460 1.1037
irintensity: 1.1351 3.5791 17.3799 8.4042 0.0206 3.2071 1.6684 0.1386 4.1946 4.2943 1.1667 2.2287 0.3635 3.8974 0.0014 1.5561 2.2239 1.1650 4.7717 1.8119 12.6024 5.3581 0.4287 0.0005 33.9409 3.2099 2.4796 16.6421 3.6750 228.9499 49.5102 2.9857 13.3235 8.4053 54.4779 48.1136 5.2867 12.0418 0.0519 25.7442 1.0908 8.4215 20.2556 18.9581 7.6926 57.9822 14.4551 4.1424 10.8125 4.3782 9.4911 4.5680 16.5648 62.5552 51.9066 26.8837 39.5963 2.3395 6.5371 59.2501 48.7864 45.7048 262.6775 489.2602 15.8710 847.6463 171.4343 908.9859 236.5310 288.9868 19.2505 115.7272 1.9646 1.7503 36.1303 16.2308 557.8747 19.6311 301.1333 74.6508 62.7885 17.1409 315.5254 168.0080 250.7552 3.1791 223.3210 142.0132 234.1102 19.7113 7.5972 15.1269 6.0322 4.8835 12.0648 1.0007 5.2265 0.7450 5.5183 0.9740 125.1196 60.2061
temp: 298.150 k
press: 1.00000 atm
elementType: 16 8 8 8 8 7 7 7 7 7 6 6 6 6 6 6 6 6 6 6 6 6 6 1 1 1 1 1 1 1 1 1 1 1 1 1
symmnumber: 1
zpe: 667878.5 jmol-1
zpe.correction: 0.254381 hartree
zpe.thermalcorrener: 0.277439 hartree
zpe.thermalcorrenthalpy: 0.278383 hartree
zpe.thermalcorrgfe: 0.198624 hartree
zpe.sumelectzpe: -1474.101794 hartree
zpe.sumelectthermal: -1474.078736 hartree
zpe.sumelectthermalent: -1474.077792 hartree
zpe.sumelectthermalfe: -1474.157551 hartree
dipole: -9.5324 -1.4305 0.0068
dipole: 9.6391
quadrupole: -138.8944 -136.0251 -143.0140
quadrupole: 65.9563 -0.1543 0.0018
quadrupole: 0.4168 3.2861 -3.7028 65.9563 -0.1543 0.0018
hfenergy: -1474.3561751 hartree
pointgroup: C01 [X(C13H13N5O4S1)]
dipole: -3.7471502 -0.5776276 0.0833454 debye
polarizability: 824.6205748|18.1583935|227.2047302|-5.9847761|-14.5096209|89.8094239 unknown
InChI: InChI=1S/C13H13N5O4S/c1-7-12(8(2)16-17-13(14)19)23-10(15-7)5-3-9-4-6-11(22-9)18(20)21/h3-6,17H,14H2,1-2H3
charge 0 multiplicity 1
36 atoms
S  -0.870113 -1.483034 0.29582
O  4.45672 -0.211255 0.136859
O  8.003032 -0.747944 0.177262
O  6.252616 -2.239758 0.340154
O  -6.937971 1.471995 0.026547
N  -0.609945 1.158959 0.023405
N  -4.697476 -0.177539 0.187315
N  -5.973769 -0.679432 0.247809
N  6.734535 -1.043829 0.213875
N  -8.302261 -0.411023 0.234223
C  -2.346165 -0.439628 0.199149
C  -1.974911 0.92741 0.056977
C  0.13634 0.053004 0.131293
C  -3.67552 -1.031466 0.267226
C  -2.913327 2.095824 -0.055814
C  1.570496 -0.026696 0.130929
C  3.811609 1.045526 0.009469
C  2.381399 1.087229 0.011739
C  -3.86718 -2.534742 0.421008
C  4.792999 2.051961 -0.098749
C  5.830055 0.057092 0.103649
C  6.072572 1.423188 -0.03883
C  -7.067033 0.230803 0.158612
H  -2.323072 3.02119 -0.143629
H  -3.585409 1.992369 -0.925537
H  -3.589356 2.157972 0.81442
H  2.029538 -1.01681 0.230577
H  1.917886 2.074595 -0.088034
H  -4.406833 -2.773864 1.359483
H  -2.910884 -3.077025 0.451768
H  -4.448438 -2.951278 -0.426292
H  4.591796 3.115695 -0.207927
H  7.054512 1.885562 -0.090896
H  -6.156042 -1.686882 0.350489
H  -8.427106 -1.415344 0.344676
H  -9.126292 0.182372 0.176774
