program: Gaussian 09
title: 000218067
version: EM64L-G09RevD.01
frameworkgroup: C1[X(C17H14O2)]
method: RPBEPBE
basis: SDD
operation: Freq
keyword: #pfreq=noraman
keyword: PBEPBE/SDD
title: #p freq=noraman PBEPBE/SDD
converged: YES YES NO NO
title: Mulliken charges:
elementType: O O C C C C C C C C C C C C C C C C C H H H H H H H H H H H H H H
charge: -0.460026 -0.248603 0.360304 0.090141 0.477251 -0.411925 -0.360892 -0.258409 -0.316170 -0.222665 -0.234238 -0.236633 -0.383806 -0.392076 -0.241165 0.087428 -0.236922 -0.237859 -0.237570 0.243506 0.256885 0.228590 0.218096 0.298476 0.225132 0.226533 0.233259 0.230555 0.228958 0.228972 0.230319 0.232718 0.381837
chargesum: 0.00000
title: Mulliken charges with hydrogens summed into heavy atoms:
elementType: O O C C C C C C C C C C C C C C C C C
charge: -0.078189 -0.248603 0.360304 0.090141 0.477251 -0.168419 -0.104008 -0.029819 -0.098074 0.075811 -0.009106 -0.010100 -0.150547 -0.161520 -0.012208 0.087428 -0.007950 -0.007540 -0.004852
polarizability: 4.82868734e+02 1.64758568e+01 1.94864374e+02 4.68691871e+00 5.29608932e+00 8.76785233e+01
1716.lowfreq: -8.6557 -4.1659 -0.1719 -0.0001 0.0006 0.0006 27.3981 31.6327 43.0428
frequency: 27.3832 31.6309 43.0352 49.2308 66.5211 99.0038 124.2313 179.5341 194.3011 221.8920 243.8989 280.2956 346.6166 354.0215 360.5498 402.3185 406.1521 420.6954 476.1890 507.5958 517.6072 558.6258 603.8089 614.0718 616.8294 622.1158 649.9721 692.8518 699.0932 727.1015 747.0039 769.6729 778.5519 845.0180 845.1674 853.9329 884.4020 900.4210 917.4477 930.0180 936.5822 971.4461 979.7764 986.9032 987.8747 992.7114 995.3296 1009.0172 1025.2867 1028.7091 1061.2075 1083.2990 1088.2517 1173.4107 1173.6095 1187.3568 1190.6298 1198.8976 1226.1145 1238.3200 1265.7088 1292.2706 1318.8574 1324.6233 1337.3709 1370.3105 1380.4105 1389.4763 1433.5469 1439.9915 1479.7474 1484.0460 1562.7021 1578.9712 1582.2283 1595.6739 1606.2159 1614.6089 1623.0428 3076.1741 3084.1424 3120.8742 3121.7131 3129.4208 3131.1470 3141.6320 3143.8785 3152.3176 3160.2593 3167.3325 3180.6094 3181.5268 3510.5800
redmass: 3.9908 6.4393 5.2102 6.0158 4.7184 5.3446 4.8789 3.4559 5.6118 4.5153 2.6644 5.4268 6.9860 4.7291 4.0235 2.8046 2.8822 4.0346 4.8004 2.7821 3.2639 5.1700 1.3851 6.3277 4.9346 4.4956 6.4639 1.7070 1.7571 3.4511 5.3531 1.7533 2.5070 1.2804 1.2480 4.2926 1.4318 4.5688 1.6306 1.5182 1.7660 1.3892 1.3952 6.1297 3.8854 1.4535 1.3073 1.1535 2.1858 2.4097 2.5783 1.6471 1.6230 1.0617 1.0694 2.2285 1.1242 1.1438 2.0258 1.7382 2.3205 1.4869 1.6430 1.3813 1.4517 3.0648 3.8374 4.4220 2.3316 2.3484 2.2225 2.3074 6.0990 5.3243 5.8047 5.2952 6.1490 6.6139 5.7617 1.0894 1.0877 1.0870 1.0850 1.0863 1.0881 1.0915 1.0939 1.0962 1.0990 1.1015 1.0961 1.0903 1.0637
irintensity: 0.1012 0.4209 0.5505 0.7186 0.0899 0.8176 0.1137 0.1231 1.0532 0.4995 2.0605 1.6294 1.0370 0.6930 4.9393 0.1128 0.4513 11.6038 15.4368 4.1636 5.4437 20.6956 120.5441 1.7352 13.7442 25.9495 9.2222 51.2502 52.6284 3.9336 10.1061 51.7876 60.8824 0.0317 3.4306 0.4328 0.5439 51.0686 9.7369 2.2855 0.4119 2.0539 0.0736 1.0648 1.2233 2.8869 13.8782 59.4998 6.8527 14.2783 162.7018 13.8969 4.1251 0.1099 0.8077 10.6867 8.5959 3.1659 17.9727 3.9457 6.8137 14.8004 10.0450 7.7702 18.6088 24.8011 37.3150 4.1780 13.5043 11.0654 23.5595 3.7396 10.6151 27.3913 2.2235 304.6239 83.9822 283.0766 15.6506 12.3308 24.9091 8.3351 3.6997 1.9847 2.8785 10.6143 31.0979 36.4395 43.7979 37.6584 10.5560 18.4051 34.1662
temp: 298.150 k
press: 1.00000 atm
elementType: 8 8 6 6 6 6 6 6 6 6 6 6 6 6 6 6 6 6 6 1 1 1 1 1 1 1 1 1 1 1 1 1 1
symmnumber: 1
zpe: 676637.5 jmol-1
zpe.correction: 0.257718 hartree
zpe.thermalcorrener: 0.274137 hartree
zpe.thermalcorrenthalpy: 0.275081 hartree
zpe.thermalcorrgfe: 0.211295 hartree
zpe.sumelectzpe: -805.329366 hartree
zpe.sumelectthermal: -805.312947 hartree
zpe.sumelectthermalent: -805.312003 hartree
zpe.sumelectthermalfe: -805.375789 hartree
dipole: -3.1785 -1.4407 0.3096
dipole: 3.5035
quadrupole: -97.5827 -97.7107 -116.1868
quadrupole: -8.4165 3.6845 2.1922
quadrupole: 6.2440 6.1161 -12.3601 -8.4165 3.6845 2.1922
hfenergy: -805.5870839 hartree
pointgroup: C01 [X(C17H14O2)]
dipole: -1.2408262 -0.5803953 0.1530197 debye
polarizability: 481.9878839|22.4944127|195.8195558|7.2854701|-2.6958495|87.6041922 unknown
InChI: InChI=1S/C17H14O2/c18-17(19)16(15-11-5-2-6-12-15)13-7-10-14-8-3-1-4-9-14/h1-13,18H
charge 0 multiplicity 1
33 atoms
O  0.381271 2.680241 -0.340159
O  2.677149 2.77975 -0.512487
C  2.979365 -0.075971 -0.010145
C  1.646263 0.59832 -0.095917
C  -3.340234 -0.536194 0.045902
C  3.159423 -1.36784 -0.582942
C  4.083442 0.517089 0.664859
C  0.493559 -0.173411 0.034254
C  -1.89334 -0.756819 0.117345
C  -0.901185 0.187467 -0.061606
C  4.388376 -2.051207 -0.469738
C  5.310454 -0.168976 0.781219
C  -3.92266 0.737389 -0.235201
C  -4.216089 -1.641109 0.265348
C  5.471077 -1.456393 0.218296
C  1.656367 2.065522 -0.328144
C  -5.32034 0.891901 -0.292377
C  -5.615704 -1.485398 0.208056
C  -6.17548 -0.21684 -0.071473
H  2.341809 -1.822737 -1.154197
H  3.979326 1.515151 1.097432
H  0.672664 -1.236831 0.256052
H  -1.583672 -1.790741 0.338233
H  -1.144502 1.230231 -0.274236
H  4.505187 -3.038617 -0.930502
H  6.144252 0.304407 1.311614
H  -3.277854 1.60535 -0.409204
H  -3.785595 -2.626716 0.482634
H  6.427869 -1.983286 0.305161
H  -5.750227 1.876149 -0.509287
H  -6.269113 -2.347655 0.380266
H  -7.262805 -0.091186 -0.117107
H  0.530347 3.649862 -0.510746
