program: Gaussian 09
title: 000218061
version: EM64L-G09RevD.01
frameworkgroup: C1[X(C11H12N2OS)]
method: RPBEPBE
basis: SDD
operation: Freq
keyword: #p
keyword: freq=noraman
keyword: PBEPBE/SDD
title: #p freq=noraman PBEPBE/SDD
converged: YES YES NO YES
title: Mulliken charges:
elementType: S O N N C C C C C C C C C C C H H H H H H H H H H H H
charge: 0.305378 -0.271869 0.047688 -0.359933 -0.385453 -0.557624 -0.380271 0.587684 -0.377954 -0.491101 -0.403618 0.116706 -0.449035 0.135752 -0.250796 0.201728 0.282023 0.206886 0.207069 0.184251 0.204891 0.211835 0.206121 0.215368 0.220337 0.340835 0.253103
chargesum: 0.00000
title: Mulliken charges with hydrogens summed into heavy atoms:
elementType: S O N N C C C C C C C C C C C
charge: 0.305378 -0.271869 0.047688 -0.019098 0.028502 -0.073874 0.008872 0.587684 0.040002 -0.055396 -0.403618 0.116706 -0.449035 0.135752 0.002307
polarizability: 2.08897286e+02 -7.41911983e+00 1.61837634e+02 -9.30271021e+00 -2.77234211e+00 8.22448730e+01
1716.lowfreq: -7.1688 -5.6690 -0.0019 -0.0014 -0.0010 8.4102 55.1375 77.5034 120.6727
frequency: 55.1156 77.4820 120.6671 164.9685 189.3232 202.3081 234.8401 269.6698 325.0198 338.4918 361.2447 366.9710 418.9022 455.2735 474.0746 513.2351 519.8141 538.7426 581.8956 613.2458 634.1458 694.2531 742.9945 751.7746 779.2797 785.1524 819.4425 872.6829 875.8340 893.8554 916.6195 932.0544 960.4599 972.9791 1048.8882 1071.0775 1099.5792 1111.2033 1132.4694 1138.1424 1174.6393 1216.1379 1224.2551 1261.3749 1266.1329 1275.6674 1322.3484 1331.4166 1347.2843 1351.9813 1357.6202 1361.2300 1390.7307 1424.6312 1451.9367 1457.8106 1460.1686 1464.6286 1466.3921 1476.2402 1540.4625 1557.7462 1636.3854 2955.8400 2957.1025 2960.5710 2975.1372 2976.4291 3017.0890 3032.2096 3036.7340 3041.0713 3065.3690 3164.0687 3511.2620
redmass: 3.9809 4.1002 4.3324 3.8322 5.2235 3.6826 3.4837 3.4429 2.2969 5.1741 3.0634 4.1210 5.7807 3.2220 2.9164 3.9651 4.6446 5.8235 5.4074 4.5137 4.6591 3.4908 1.6299 2.8065 4.4471 3.6780 1.4457 1.4038 2.1443 2.7722 4.1791 4.9469 2.1722 2.1753 2.5186 2.0959 2.4765 2.1244 2.2517 1.8427 2.7007 1.2140 1.3213 2.8214 1.2436 1.2315 1.4260 1.4916 1.5513 1.7000 1.4683 1.4314 1.9852 4.9197 2.1452 1.2666 1.3704 1.1234 1.0963 1.1038 4.6626 6.6683 6.7170 1.0619 1.0661 1.0682 1.0638 1.0603 1.0960 1.1019 1.0948 1.1021 1.0930 1.0938 1.0781
irintensity: 2.5813 0.1283 5.9120 1.3874 5.3144 1.3022 1.9926 2.7174 0.3431 3.6591 2.8816 0.3739 1.1444 3.3399 2.5401 0.3953 5.4578 14.4620 1.1642 11.3400 0.9216 1.2498 67.7772 7.7397 29.8920 11.9793 8.2047 4.6800 5.8722 0.6726 14.5261 26.5271 11.0989 11.9845 11.6088 1.8988 11.9791 7.8272 33.3601 15.4317 1.9718 7.4078 5.2101 33.5041 2.8847 5.8151 3.4243 0.3006 0.5905 26.8669 1.3420 1.2674 7.8213 1.0566 4.1735 6.3810 20.3681 12.7495 13.5922 23.1853 66.6584 63.0325 411.0661 40.1065 27.9355 15.7510 27.1010 45.2223 79.0806 28.9257 25.8172 82.6302 4.3786 4.8631 57.6760
temp: 298.150 k
press: 1.00000 atm
elementType: 16 8 7 7 6 6 6 6 6 6 6 6 6 6 6 1 1 1 1 1 1 1 1 1 1 1 1
symmnumber: 1
zpe: 559638.7 jmol-1
zpe.correction: 0.213155 hartree
zpe.thermalcorrener: 0.225600 hartree
zpe.thermalcorrenthalpy: 0.226544 hartree
zpe.thermalcorrgfe: 0.174403 hartree
zpe.sumelectzpe: -1008.089653 hartree
zpe.sumelectthermal: -1008.077208 hartree
zpe.sumelectthermalent: -1008.076264 hartree
zpe.sumelectthermalfe: -1008.128405 hartree
dipole: 0.2970 -0.1950 0.2203
dipole: 0.4180
quadrupole: -72.5681 -107.5050 -96.1731
quadrupole: -5.4016 -2.5477 1.7727
quadrupole: 19.5140 -15.4229 -4.0910 -5.4016 -2.5477 1.7727
hfenergy: -1008.3028076 hartree
pointgroup: C01 [X(C11H12N2O1S1)]
dipole: 0.1163756 0.0775572 -0.0865592 debye
polarizability: 208.9797049|7.3494987|161.8882699|8.7401208|-2.093443|82.1118186 unknown
InChI: InChI=1S/C11H12N2OS/c14-10-9-7-4-2-1-3-5-8(7)15-11(9)13-6-12-10/h6,12H,1-5H2
charge 0 multiplicity 1
27 atoms
S  -0.125003 2.403772 0.058067
O  -1.606573 -2.50217 0.181145
N  -2.74353 1.520736 -0.236787
N  -3.195946 -0.821642 -0.146276
C  2.488086 -1.644935 -0.522664
C  1.345869 -1.45507 0.511518
C  3.725648 -0.736448 -0.317242
C  0.533402 -0.18397 0.322698
C  3.501939 0.778498 -0.545226
C  2.554734 1.457734 0.484491
C  1.10327 1.084702 0.314947
C  -0.90166 -0.140472 0.122797
C  -1.425602 1.168425 -0.033965
C  -1.843246 -1.260981 0.067794
C  -3.591109 0.500142 -0.285824
H  1.789505 -1.461011 1.529656
H  0.655463 -2.313704 0.460524
H  2.824309 -2.69918 -0.463946
H  2.082918 -1.501053 -1.544169
H  4.113799 -0.889707 0.712487
H  4.528001 -1.075129 -1.003152
H  3.109799 0.951594 -1.566669
H  4.484038 1.288827 -0.488212
H  2.668975 2.555213 0.411631
H  2.887159 1.178407 1.507255
H  -3.88938 -1.575502 -0.192125
H  -4.65657 0.690124 -0.44365
