program: Gaussian 09
title: 000221337
version: EM64L-G09RevD.01
frameworkgroup: C1[X(C11H14Cl2O)]
method: RPBEPBE
basis: SDD
operation: Freq
keyword: #p
keyword: freq=noraman
keyword: PBEPBE/SDD
title: #p freq=noraman PBEPBE/SDD
converged: YES YES NO NO
title: Mulliken charges:
elementType: Cl Cl O C C C C C C C C C C C H H H H H H H H H H H H H H
charge: -0.017493 -0.060604 -0.389968 -0.388426 -0.329853 -0.619052 -0.357903 0.459812 -0.691827 0.206558 -0.410182 -0.275644 -0.101896 -0.243219 0.210832 0.224768 0.183652 0.195133 0.208067 0.242710 0.197837 0.200560 0.210973 0.220512 0.210060 0.263879 0.281892 0.368825
chargesum: 0.00000
title: Mulliken charges with hydrogens summed into heavy atoms:
elementType: Cl Cl O C C C C C C C C C C C
charge: -0.017493 -0.060604 -0.021143 0.047174 0.048932 -0.168276 0.040494 0.459812 -0.050283 0.206558 -0.146304 -0.275644 -0.101896 0.038673
polarizability: 1.81254320e+02 5.75443626e+00 1.61731836e+02 1.52095206e+01 -2.31786606e+00 8.54768596e+01
1716.lowfreq: -3.9585 -0.0011 0.0014 0.0015 2.6039 5.2230 29.7251 43.4733 57.1118
frequency: 29.6212 43.4639 57.0393 97.8915 110.3880 135.5150 143.3452 159.4224 183.7643 225.0315 229.8852 237.9845 295.9701 309.1145 322.4134 351.9140 357.7858 392.0346 423.9141 511.1942 535.7762 554.8074 606.5776 686.2102 728.0170 743.1235 754.7223 809.6422 837.9572 860.6327 871.8921 880.5334 910.6552 954.4535 996.1156 1043.8272 1060.0564 1077.2863 1104.8421 1110.5877 1124.2678 1173.8220 1197.2789 1232.5890 1241.3162 1256.0081 1271.8036 1287.4474 1292.2523 1303.1249 1340.3565 1354.8147 1384.5420 1391.5274 1407.4473 1449.0202 1466.5580 1471.3887 1477.5327 1480.5317 1487.4964 1497.5432 1569.2825 1612.9677 2938.3710 2953.5409 2968.6849 2974.2004 2974.8066 2995.2309 3019.4444 3032.0978 3050.5805 3070.8829 3075.6429 3160.2919 3186.4110 3580.7323
redmass: 5.0095 4.6841 1.6899 2.9863 3.8319 3.6400 2.5292 7.2882 5.8404 3.5176 1.2724 3.8290 1.1941 4.1313 3.8141 4.4896 12.2412 7.9889 3.4214 4.1636 3.9809 3.9888 5.2626 6.8440 1.0701 4.8160 1.1982 6.7562 1.2738 1.4021 2.1218 1.8141 2.4604 1.2503 3.9144 3.3259 1.6192 2.3884 1.4456 2.1785 1.8638 3.4739 1.6637 1.2926 1.3450 1.2802 1.8821 1.1122 1.1575 1.4514 1.4297 1.6097 5.1680 1.2146 4.6414 2.9130 1.0721 1.0869 1.0431 1.0990 1.0987 1.1163 7.4501 7.7299 1.0690 1.0593 1.0611 1.0521 1.0461 1.0963 1.0978 1.0977 1.0996 1.1008 1.0993 1.0927 1.0936 1.0655
irintensity: 0.1635 0.6116 0.0280 0.0101 0.0197 0.0776 0.0858 1.1818 2.0125 1.5942 0.2096 3.1811 116.5166 3.2849 4.5815 5.9181 3.2539 2.9869 0.5532 11.1018 3.7583 6.1020 2.4769 64.9602 10.4193 6.8125 1.5809 17.8119 5.0640 24.9861 12.0260 15.0436 24.3762 0.1092 2.5548 3.4706 5.1700 0.1255 1.4721 18.0514 96.5675 128.6660 11.3491 15.8180 8.8463 20.6854 3.6324 4.0173 2.2385 1.0189 1.0749 0.7964 25.5167 10.7465 3.6018 127.0617 0.2443 1.7120 11.7250 9.7865 8.9856 21.5143 30.2749 9.5609 24.6441 17.9554 2.4636 95.7806 21.0708 6.1788 6.3441 14.8267 48.5788 86.9647 48.7195 1.2599 0.9610 41.3940
temp: 298.150 k
press: 1.00000 atm
elementType: 17 17 8 6 6 6 6 6 6 6 6 6 6 6 1 1 1 1 1 1 1 1 1 1 1 1 1 1
symmnumber: 1
zpe: 583163.0 jmol-1
zpe.correction: 0.222115 hartree
zpe.thermalcorrener: 0.237565 hartree
zpe.thermalcorrenthalpy: 0.238509 hartree
zpe.thermalcorrgfe: 0.177718 hartree
zpe.sumelectzpe: -1421.845771 hartree
zpe.sumelectthermal: -1421.830321 hartree
zpe.sumelectthermalent: -1421.829377 hartree
zpe.sumelectthermalfe: -1421.890167 hartree
dipole: 4.1604 -1.1432 0.9122
dipole: 4.4100
quadrupole: -96.1613 -105.7457 -98.8948
quadrupole: -0.2056 2.2483 -0.0174
quadrupole: 4.1059 -5.4784 1.3725 -0.2056 2.2483 -0.0174
hfenergy: -1422.0678859 hartree
pointgroup: C01 [X(C11H14Cl2O1)]
dipole: 1.6476569 0.3072386 -0.4485449 debye
polarizability: 179.8537394|-9.2122587|160.3023497|-16.4133188|-12.3569871|88.3069264 unknown
InChI: InChI=1S/C11H14Cl2O/c1-2-3-4-5-8-6-9(12)7-10(13)11(8)14/h6-7,14H,2-5H2,1H3
charge 0 multiplicity 1
28 atoms
Cl -3.095055 -2.536329 0.891361
Cl -3.456656 2.938881 0.00985
O  -0.32375 -2.209781 -0.129154
C  2.070618 0.166019 0.159004
C  3.533871 0.118495 -0.331972
C  1.047528 0.250914 -1.012363
C  4.556673 0.038671 0.824697
C  -0.400768 0.233527 -0.546785
C  6.017703 -0.015624 0.329146
C  -1.002009 -0.985448 -0.114487
C  -1.164907 1.423861 -0.503115
C  -2.338254 -0.982515 0.348181
C  -2.490371 1.392035 -0.035264
C  -3.099857 0.199763 0.396394
H  1.862835 -0.721504 0.791497
H  1.926759 1.045054 0.817083
H  3.675059 -0.755437 -1.003156
H  3.746288 1.018199 -0.946204
H  1.245795 -0.574093 -1.732516
H  1.237274 1.181677 -1.577549
H  4.340118 -0.856916 1.441849
H  4.422602 0.914832 1.490969
H  6.268293 0.881337 -0.267927
H  6.72831 -0.067821 1.173901
H  6.187828 -0.902368 -0.310236
H  -0.720193 2.366752 -0.835214
H  -4.130837 0.182233 0.75682
H  0.589505 -2.099016 -0.493511
