program: Gaussian 09
title: 000218057
version: EM64L-G09RevD.01
frameworkgroup: C1[X(C7H15NO3)]
method: RPBEPBE
basis: SDD
operation: Freq
keyword: #p
keyword: freq=noraman
keyword: PBEPBE/SDD
title: #p freq=noraman PBEPBE/SDD
converged: YES YES NO NO
title: Mulliken charges:
elementType: O O O N C C C C C C C H H H H H H H H H H H H H H H
charge: -0.259434 -0.436061 -0.250987 -0.102002 -0.369255 -0.376050 -0.297512 -0.634605 -0.310754 0.294723 -0.754681 0.229867 0.218931 0.180000 0.251814 0.237843 0.236578 0.222511 0.232283 0.196212 0.230033 0.182749 0.330999 0.252118 0.249074 0.245606
chargesum: 0.00000
title: Mulliken charges with hydrogens summed into heavy atoms:
elementType: O O O N C C C C C C C
charge: -0.259434 -0.105062 -0.250987 -0.102002 0.079543 0.055764 0.176909 0.016401 0.102028 0.294723 -0.007884
polarizability: 1.14182343e+02 1.09059156e+00 9.08490564e+01 2.74699352e-01 4.27598118e+00 7.80409979e+01
1716.lowfreq: -42.6134 -14.6451 -7.3070 0.0004 0.0009 0.0010 3.4664 21.6930 38.8767
frequency: -42.5493 20.8906 38.5860 49.5924 75.3708 82.8922 119.5392 187.3415 197.2502 243.6815 284.0941 293.8286 305.4256 346.3065 378.9455 402.4375 453.6725 505.0640 580.4088 625.9439 763.0438 793.5567 811.8447 844.7270 945.1690 956.9420 1001.2658 1024.7291 1032.2571 1046.5090 1055.4095 1069.9556 1076.3161 1110.1304 1140.7196 1187.4645 1198.0270 1241.8448 1257.7933 1289.3424 1298.3998 1315.3628 1328.4993 1348.6193 1377.1850 1383.7940 1385.8255 1435.3581 1447.3130 1456.0247 1458.5808 1466.9052 1471.5094 1478.1136 1481.7847 1486.0493 1643.0908 2846.4144 2867.5220 2911.8756 2962.9950 3008.3339 3026.2929 3034.7056 3044.7091 3049.4869 3081.6403 3096.1868 3099.4392 3127.4124 3139.5147 3557.5418
redmass: 1.0841 5.0093 3.1214 3.1202 3.3245 2.8354 2.9011 3.0047 1.4918 1.5819 2.4303 2.8718 1.4759 3.4423 3.0841 2.7067 3.2586 3.3401 3.3579 4.4750 2.1285 1.1725 1.7382 3.5975 6.5747 4.1082 1.8792 2.3754 2.1208 1.6243 1.8958 3.0029 2.2039 1.2883 1.5181 1.7363 3.3066 1.7100 1.5993 1.1426 1.1751 1.3984 1.3519 1.2291 1.3091 1.2636 1.2857 1.1554 1.0856 1.0730 1.0486 1.0785 1.0536 1.0768 1.0845 1.0640 9.6526 1.0708 1.0563 1.0692 1.0696 1.0365 1.0737 1.0631 1.0878 1.0878 1.1005 1.0971 1.0964 1.1068 1.1012 1.0661
irintensity: 1.8206 0.3854 2.6091 5.1773 3.5331 1.4608 1.3175 0.2049 1.4371 4.9036 46.8380 12.9855 107.0530 1.8549 48.6064 0.3919 11.5522 3.7902 5.9352 3.4374 14.6214 8.0765 1.2028 9.2181 64.0850 107.0360 44.2893 54.6945 19.3763 9.0498 13.2323 10.2033 35.7861 0.6236 8.3267 34.3520 272.0792 19.8162 21.0629 3.2378 5.2629 12.8586 4.0036 22.9127 0.3950 25.8466 33.5875 4.7744 8.3005 16.8245 17.2179 3.7566 8.1877 9.4774 14.3455 9.6079 169.5011 78.4898 142.1158 73.6937 62.0022 3.3440 46.2219 23.7483 8.3269 26.0315 34.3728 6.9635 32.5490 15.8559 9.4146 6.2342
temp: 298.150 k
press: 1.00000 atm
elementType: 8 8 8 7 6 6 6 6 6 6 6 1 1 1 1 1 1 1 1 1 1 1 1 1 1 1
symmnumber: 1
zpe: 575133.4 jmol-1
zpe.correction: 0.219057 hartree
zpe.thermalcorrener: 0.232311 hartree
zpe.thermalcorrenthalpy: 0.233255 hartree
zpe.thermalcorrgfe: 0.177021 hartree
zpe.sumelectzpe: -555.221418 hartree
zpe.sumelectthermal: -555.208164 hartree
zpe.sumelectthermalent: -555.207219 hartree
zpe.sumelectthermalfe: -555.263453 hartree
dipole: -0.5043 3.3122 -1.2142
dipole: 3.5636
quadrupole: -58.6197 -74.8706 -66.5578
quadrupole: 5.4477 -6.1501 -0.4444
quadrupole: 8.0630 -8.1879 0.1249 5.4477 -6.1501 -0.4444
hfenergy: -555.4404749 hartree
pointgroup: C01 [X(C7H15N1O3)]
dipole: 0.1078003 1.343375 0.3865289 debye
dipolederiv: -1.1485621 0.2993453 -0.2399712 0.3893599 -0.6501687 0.2926688 -0.3924258 0.34861 -0.6121668 -0.6892293 -0.2498353 -0.1247384 -0.2762274 -0.6874763 0.1773696 -0.1034625 0.2242551 -0.2653221 -0.6925222 -0.2196025 0.1080098 0.0824418 -0.7402311 0.2945302 -0.0965164 0.2564985 -0.509602 -0.765569 0.0484408 0.03974 -0.0657431 -0.5927569 -0.0516473 0.0453151 0.0091991 -0.5253135 0.5820938 0.0517031 0.0414935 -0.0253594 0.1121294 -0.1023668 -0.0264854 -0.0099016 0.2325558 0.1497944 0.1538649 -0.1443497 0.1973623 0.2993338 -0.0378386 -0.1617799 -0.0650027 0.3459081 0.7216977 -0.1538034 0.0979604 0.0295834 0.2231576 0.0476574 0.1018173 -0.0752048 0.2830107 0.1873356 -0.2018342 -0.0560974 -0.2424576 0.3441975 0.1317227 -0.0355598 0.1086328 0.3814962 0.4437302 0.107271 0.0083763 0.1359452 0.5687103 -0.13522 -0.0306463 -0.1557346 0.277242 1.332571 0.0318478 0.1755342 -0.3834153 1.0322106 -0.6320214 0.5201978 -0.632312 0.7185856 -0.4477701 -0.0214202 -0.0695707 0.0323284 0.004031 0.0139081 -0.1286495 0.0088172 -0.0021612 -0.0893997 -0.0006943 -0.0366143 0.0512333 0.0577036 0.0724861 -0.1313878 0.0138978 -0.1557664 0.0250566 -0.0377653 0.0107361 -0.0467972 -0.1482545 -0.0039775 0.0171542 0.0221482 0.0681994 -0.0509137 -0.0853989 0.1216572 -0.0410735 0.0006251 -0.0485697 0.1429501 0.0526435 -0.231413 -0.0316661 0.0838218 -0.026013 0.0917752 -0.0141329 0.0070251 -0.0192791 -0.0063099 0.0666976 0.0107439 0.0315879 -0.0240028 0.0096252 0.0675573 0.0784499 -0.0226809 0.0447994 -0.081806 0.0031692 0.0034479 -0.032272 -0.0759257 -0.0753047 -0.0529998 0.0045694 0.017471 0.0841807 -0.1838559 0.0122394 -0.0490285 -0.0486623 0.1098747 -0.0311382 -0.0537081 -0.0332751 0.0570458 0.0917625 -0.098865 0.0509493 -0.0246958 -0.1219096 0.0762756 0.0455118 0.089045 0.028063 0.0330979 0.054253 -0.0178735 0.0763987 -0.0304418 -0.0287922 0.0994752 -0.1810334 -0.2673397 0.0532391 0.0057502 0.0904905 -0.0009863 0.0345311 -0.0307882 0.0643984 -0.0141597 -0.0967873 -0.1143985 0.1130739 -0.0476772 0.1098488 -0.1361203 0.0775739 -0.0146943 0.0279322 0.0478684 0.3697562 0.0645584 0.1016159 0.0742361 0.2537629 -0.1227701 0.1345761 -0.070023 0.0464844 0.0860409 -0.030957 0.0089704 -0.077814 -0.0135517 0.0823016 0.0382829 0.0913778 0.0687069 0.0438695 0.0477897 0.018361 0.0728119 -0.019647 -0.0596236 0.0508106 -0.0501209 0.1137301 0.0799282 -0.008819 -0.0056857 -0.0437925 0.1221703 -0.0142156 -0.047783 -0.02225 -0.0720967 unknown
polarizability: 114.195821|0.5353628|90.1484797|1.1599156|-5.0912887|78.7280968 unknown
InChI: InChI=1S/C7H15NO3/c1-7(10)11-6-4-8(2)3-5-9/h9H,3-6H2,1-2H3
charge 0 multiplicity 1
26 atoms
O  2.196477 0.632262 -0.633845
O  -3.579886 -2.237773 0.097352
O  2.133376 -1.200953 0.810551
N  -1.527567 0.965955 -0.02591
C  -0.08337 1.201963 0.195251
C  -2.0108 -0.337302 0.489218
C  0.733439 0.466388 -0.884641
C  -2.387039 2.103365 0.357513
C  -3.092243 -0.95151 -0.425236
C  2.778388 -0.283087 0.252402
C  4.258627 -0.013844 0.414748
H  0.258471 0.871474 1.203818
H  0.118206 2.285669 0.118134
H  -2.418783 -0.236905 1.528722
H  -1.166524 -1.046599 0.553551
H  0.567317 0.909821 -1.877421
H  0.493144 -0.610999 -0.898982
H  -3.431244 1.904878 0.057827
H  -2.05874 3.016905 -0.168828
H  -2.381608 2.311964 1.456715
H  -2.661668 -1.189177 -1.410163
H  -3.932113 -0.240076 -0.574204
H  -3.97968 -2.091165 0.992054
H  4.568367 0.876382 -0.150866
H  4.828721 -0.891907 0.063687
H  4.492831 0.119971 1.484854
