program: Gaussian 09
title: 000218047
version: EM64L-G09RevD.01
frameworkgroup: C1[X(C21H24N4O)]
method: RPBEPBE
basis: SDD
operation: Freq
keyword: #p
keyword: freq=noraman
keyword: PBEPBE/SDD
title: #p freq=noraman PBEPBE/SDD
converged: YES YES NO NO
title: Mulliken charges:
elementType: O N N N N C C C C C C C C C C C C C C C C C C C C C H H H H H H H H H H H H H H H H H H H H H H H H
charge: -0.248889 -0.100264 -0.388339 -0.131517 -0.132547 -0.349180 -0.351962 -0.323603 -0.317792 -0.310489 -0.413528 0.059123 0.333750 0.020881 0.384075 -0.390798 0.386560 0.373403 -0.580297 -0.835907 -0.389776 -0.431075 -0.433846 -0.411072 -0.248281 -0.243919 0.234905 0.197837 0.191073 0.205242 0.229922 0.193550 0.215219 0.190655 0.189282 0.210931 0.226123 0.259044 0.311943 0.230353 0.218076 0.237139 0.244840 0.232465 0.293887 0.235019 0.235346 0.238858 0.226551 0.227026
chargesum: 0.00000
title: Mulliken charges with hydrogens summed into heavy atoms:
elementType: O N N N N C C C C C C C C C C C C C C C C C C C C C
charge: -0.248889 -0.100264 -0.076396 -0.131517 -0.132547 0.083562 0.044353 0.099869 0.088082 0.089724 0.071639 0.059123 0.333750 0.020881 0.384075 -0.160445 0.386560 0.373403 -0.362221 -0.121462 -0.095890 -0.196056 -0.198500 -0.172214 -0.021730 -0.016893
polarizability: 4.87129525e+02 4.83197106e+01 2.74015055e+02 -1.49381022e+01 1.02367028e+01 1.39395174e+02
1716.lowfreq: -13.4010 -3.5645 -0.0006 0.0005 0.0010 2.3040 10.1171 12.4369 19.6423
frequency: 2.7326 10.9133 19.5532 36.2375 45.1499 70.2679 79.4288 101.1374 115.8190 158.5987 177.5020 183.4175 188.0398 217.0424 228.6721 246.9239 255.7651 264.3488 290.4547 325.4820 342.3510 362.0477 376.7401 381.0552 404.6026 410.6270 425.5199 432.7801 466.7854 474.3940 482.0910 499.8320 514.8852 525.6589 555.5144 576.5369 604.1082 618.3252 625.0894 671.3375 677.5744 729.1382 749.4302 761.7485 764.6790 766.5003 787.8284 791.9652 807.9486 837.7109 840.3692 843.0293 877.1749 894.3799 901.4645 908.4657 912.9164 941.7977 962.1011 984.8857 988.5143 995.5111 1010.9246 1020.9973 1023.7533 1028.6897 1035.0444 1045.1039 1051.6969 1057.5100 1076.1412 1085.9284 1103.1214 1120.0398 1127.0709 1135.9207 1155.9521 1166.9625 1171.4610 1181.0200 1190.1171 1206.9101 1225.9793 1235.9010 1249.1191 1269.7355 1273.4215 1277.0512 1294.3004 1296.4464 1305.9696 1318.7050 1333.7678 1347.5546 1352.2736 1365.0406 1369.2646 1373.3625 1385.0591 1390.6396 1406.4491 1414.6659 1417.9085 1431.0394 1441.1006 1443.0174 1448.0778 1450.4852 1453.0795 1462.3883 1468.4465 1468.7455 1475.2532 1486.5688 1511.7163 1555.5453 1578.7428 1595.7162 1605.7477 1637.8719 2865.9217 2880.6126 2911.1339 2951.7246 2958.9274 2959.3140 3015.4472 3023.7337 3027.4058 3031.0541 3051.1798 3077.2608 3084.9065 3087.4254 3097.3257 3116.7706 3122.4451 3123.4488 3126.9276 3140.8884 3144.9277 3160.8118 3174.2003 3589.2031
redmass: 5.0838 4.8622 2.9636 4.4012 5.0575 4.8551 4.7205 5.4924 3.7910 1.6511 1.6734 3.6890 2.9488 3.8854 3.0213 2.0756 3.9370 3.8233 3.6670 2.4990 2.5711 3.4204 2.1062 2.2505 2.0497 3.7595 3.1812 4.1605 2.7813 2.4819 4.5821 5.4488 6.3820 4.1421 5.5931 3.0804 4.1263 3.0347 4.2468 2.8869 6.0596 2.6164 2.1014 4.3750 3.6566 2.2420 2.3860 2.3589 3.0723 3.0311 1.8045 1.3019 1.5585 2.3237 1.6272 5.3400 1.8087 4.6661 1.4080 1.7752 1.3373 2.7458 1.3533 2.6492 2.8964 2.2251 2.5940 1.5316 2.1395 1.9437 4.1474 3.4410 2.2743 2.4902 1.7097 2.6292 1.2243 2.4603 1.1735 4.8728 1.0771 1.9142 1.5737 2.0282 1.5288 1.3305 1.6623 1.7014 1.5442 1.3721 1.2573 1.2445 1.2417 1.4212 1.8301 2.1146 1.3988 1.5287 1.6530 1.3595 2.2448 2.4108 2.3683 3.8376 1.9835 1.0850 1.1429 1.1470 1.3025 1.1056 1.0656 2.0366 1.0945 1.3897 3.5835 3.6678 7.0851 5.9232 5.6477 6.7122 1.0696 1.0703 1.0667 1.0664 1.0664 1.0390 1.0906 1.0868 1.0663 1.0973 1.0899 1.0967 1.0973 1.0966 1.1040 1.0863 1.0895 1.0898 1.0894 1.0946 1.0912 1.1003 1.0947 1.0772
irintensity: 0.1485 0.0269 0.3385 2.7997 3.5200 1.0061 1.7530 3.3549 0.8127 0.2520 5.5725 1.4909 2.4374 1.0851 8.4532 1.5345 0.0600 3.0537 0.6276 10.1579 10.0594 12.2120 55.7023 16.7455 11.5230 0.1871 11.9636 4.6383 0.6214 21.7408 3.1669 5.7613 3.7730 0.3674 9.3160 2.7655 4.5515 10.4253 2.4672 2.8182 10.7197 0.7472 38.7683 1.0454 1.7884 22.5572 1.7541 6.4524 19.8787 1.8806 2.6631 15.2152 66.5500 10.9934 3.1377 0.7966 8.3045 10.6581 10.1032 22.8231 0.0012 21.6040 0.1520 3.6998 32.4537 11.9406 12.6826 5.7755 13.8674 0.7383 13.7233 39.1459 10.8981 36.3343 10.1486 93.8511 3.2073 31.8753 4.5946 60.0469 1.2843 2.2630 16.1921 1.1549 2.4366 10.7472 22.9572 1.1850 7.1000 5.5846 54.4843 11.5448 9.8364 12.2760 13.9463 13.4693 0.1687 3.9224 118.0758 10.4124 48.7501 65.2109 3.0682 6.5606 13.0515 1.8718 25.6686 34.5286 14.8822 12.5616 15.9161 4.1597 11.5124 1.7559 71.3035 348.0587 2.8811 54.5436 6.5087 4.8804 80.3084 58.6349 80.4505 51.0334 99.4151 31.6751 11.4816 37.8945 99.0707 19.2934 23.9923 47.6426 30.0955 13.0601 15.5382 2.9131 7.8580 16.6788 5.9550 33.4466 14.4284 50.0922 6.8868 68.1568
temp: 298.150 k
press: 1.00000 atm
elementType: 8 7 7 7 7 6 6 6 6 6 6 6 6 6 6 6 6 6 6 6 6 6 6 6 6 6 1 1 1 1 1 1 1 1 1 1 1 1 1 1 1 1 1 1 1 1 1 1 1 1
symmnumber: 1
zpe: 1080385.9 jmol-1
zpe.correction: 0.411497 hartree
zpe.thermalcorrener: 0.434681 hartree
zpe.thermalcorrenthalpy: 0.435625 hartree
zpe.thermalcorrgfe: 0.353903 hartree
zpe.sumelectzpe: -1106.939621 hartree
zpe.sumelectthermal: -1106.916437 hartree
zpe.sumelectthermalent: -1106.915493 hartree
zpe.sumelectthermalfe: -1106.997215 hartree
dipole: -0.1574 6.3741 0.9451
dipole: 6.4457
quadrupole: -146.4637 -134.0114 -159.1025
quadrupole: 18.7525 0.2292 4.1107
quadrupole: 0.0622 12.5144 -12.5766 18.7525 0.2292 4.1107
hfenergy: -1107.3511181 hartree
pointgroup: C01 [X(C21H24N4O1)]
dipole: -0.0871031 -2.5337876 0.0572008 debye
polarizability: 485.7397073|-47.0234033|274.4680524|26.2651528|-13.5081569|140.3319937 unknown
InChI: InChI=1S/C21H24N4O/c1-16-14-20(19-7-6-17-4-2-3-5-18(17)15-19)23-24-21(16)22-8-9-25-10-12-26-13-11-25/h2-7,14-15,22H,8-13H2,1H3
charge 0 multiplicity 1
50 atoms
O  6.933516 2.572719 -0.62486
N  5.478919 0.109756 -0.13684
N  2.748774 -2.343182 0.828334
N  1.357102 -0.47057 0.562358
N  0.132219 0.100267 0.38007
C  4.800064 1.433091 -0.064561
C  6.592993 0.160076 -1.116154
C  4.528363 -1.003257 -0.355108
C  5.813548 2.515959 0.333479
C  7.589315 1.257465 -0.702078
C  3.920105 -1.466799 0.995327
C  1.476791 -1.848503 0.605183
C  0.346574 -2.728114 0.440657
C  -0.990032 -0.682256 0.22287
C  -2.271401 0.048129 0.029587
C  -0.888577 -2.107807 0.245071
C  -4.733766 0.111726 -0.230038
C  -4.694082 1.555247 -0.346511
C  -3.510823 -0.60892 -0.043142
C  0.515229 -4.230326 0.480965
C  -2.246454 1.485258 -0.084134
C  -3.419143 2.210178 -0.266501
C  -6.003386 -0.553595 -0.304882
C  -5.918569 2.274384 -0.534222
C  -7.182515 0.173071 -0.488271
C  -7.140826 1.599494 -0.604337
H  3.978544 1.390498 0.672694
H  4.346153 1.700403 -1.051199
H  6.228932 0.373724 -2.152905
H  7.109961 -0.818585 -1.128382
H  3.694947 -0.715041 -1.037484
H  5.068037 -1.846762 -0.827439
H  5.356396 3.518843 0.309045
H  6.204423 2.30641 1.352599
H  8.028875 0.999114 0.285982
H  8.392511 1.371765 -1.449193
H  4.68541 -2.000402 1.586043
H  3.601797 -0.579477 1.56585
H  2.887531 -3.351887 0.812273
H  -1.778031 -2.729838 0.105345
H  -3.577034 -1.6996 0.048872
H  0.9260 -4.566651 1.453859
H  -0.450278 -4.741965 0.333384
H  1.203755 -4.585784 -0.311858
H  -1.273159 1.978414 -0.018845
H  -3.379953 3.302852 -0.352188
H  -6.036283 -1.646561 -0.216197
H  -5.882831 3.367068 -0.62153
H  -8.145943 -0.345664 -0.544277
H  -8.072401 2.158035 -0.747709
