program: Gaussian 09
title: 000221325
version: EM64L-G09RevD.01
frameworkgroup: C1[X(C11H9N3O5S)]
method: RPBEPBE
basis: SDD
operation: Freq
keyword: #p
keyword: freq=noraman
keyword: PBEPBE/SDD
title: #p freq=noraman PBEPBE/SDD
converged: YES YES NO NO
title: Mulliken charges:
elementType: S O O O O O N N N C C C C C C C C C C C H H H H H H H H H
charge: 0.960202 -0.522225 -0.499169 -0.240287 -0.193753 -0.194432 -0.467214 0.034847 0.027882 -0.055518 -0.197468 -0.194394 0.396086 -0.329024 -0.330759 0.347223 -0.330852 -0.338451 -0.241598 -0.152015 0.292958 0.295078 0.298816 0.297952 0.297495 0.237208 0.274351 0.260531 0.266529
chargesum: 0.00000
title: Mulliken charges with hydrogens summed into heavy atoms:
elementType: S O O O O O N N N C C C C C C C C C C C
charge: 0.960202 -0.522225 -0.499169 -0.240287 -0.193753 -0.194432 -0.169719 0.034847 0.027882 -0.055518 0.095489 0.100684 0.396086 -0.030207 -0.032807 0.347223 -0.093644 -0.064100 0.018933 0.114514
polarizability: 3.13125463e+02 4.04516799e+01 2.20897897e+02 -9.53351294e+00 -2.77735453e+01 1.36910745e+02
1716.lowfreq: -5.6047 -1.3128 -0.0007 0.0012 0.0014 9.0829 14.0357 25.3513 26.2226
frequency: 11.7032 25.2917 26.1079 50.9308 61.0407 66.9753 102.2959 112.0647 125.5874 154.6816 176.0886 198.3696 203.8542 228.0194 269.2356 280.4545 347.0909 361.4221 373.0963 376.2613 411.7587 448.8335 472.4943 499.9760 506.5061 517.7358 582.7927 612.8363 644.1422 661.7679 680.5456 736.7206 737.0233 744.9759 782.7924 800.0102 816.2959 823.9430 853.1868 869.4074 871.4193 890.3187 912.4586 920.1534 951.5829 990.6124 993.4723 997.2898 1001.6605 1030.5230 1050.2768 1055.2989 1086.1994 1104.3546 1136.6498 1169.7326 1170.4786 1217.3727 1241.5726 1281.7650 1282.9525 1359.7726 1371.6838 1380.7034 1392.9355 1425.1701 1452.7975 1466.1318 1540.4100 1582.7309 1591.7286 1608.0227 3026.9508 3165.5513 3168.4639 3179.6904 3189.0685 3191.2222 3226.6115 3245.7617 3270.3459
redmass: 8.0357 5.0453 5.4958 8.6215 7.6337 6.2814 7.1596 8.7311 6.9723 9.3712 7.7894 7.1097 7.4014 7.0204 5.9061 5.2386 6.3221 12.9820 6.7542 7.7507 2.8642 6.1820 7.3163 4.8074 6.8426 4.4188 3.0774 7.1004 4.2118 4.8961 7.9271 3.4906 1.3547 2.3201 9.2191 3.4293 5.8383 1.3426 1.2419 5.9883 1.5897 1.3693 1.6849 2.8973 14.8770 2.9626 1.5989 2.4030 1.3866 2.3197 2.3363 2.8882 4.1356 1.2775 1.5966 2.4101 1.2289 8.9793 1.5800 1.2529 1.2587 2.3681 6.5502 2.0722 5.9266 6.7805 2.1846 4.9531 5.2830 6.2769 7.5582 8.4954 1.0879 1.0907 1.0905 1.0739 1.0954 1.0967 1.0916 1.0995 1.1082
irintensity: 0.0405 0.7892 0.2992 0.4040 1.1517 0.0629 6.7156 2.4301 2.2822 23.7115 17.2784 21.8880 10.9343 2.3988 15.7212 3.1109 10.3844 96.8236 18.8527 32.4977 0.0044 6.7527 27.7852 61.9595 13.4585 44.9493 8.1383 0.1970 1.6208 23.5421 22.8548 0.8040 83.6853 126.8364 46.4373 181.6755 90.8581 16.7432 0.9201 5.5241 46.5233 0.3969 18.6278 14.9928 66.5795 5.1317 2.2380 21.7678 0.7484 5.8930 36.7242 33.0920 4.5226 10.1185 6.2556 6.4770 11.3028 262.6979 3.7539 2.4975 2.1690 27.1560 53.7545 14.2144 60.9821 45.1071 9.3273 69.4919 11.9649 25.5877 68.6041 0.2363 22.6103 3.9959 5.1063 25.4421 3.7848 0.9308 4.9378 0.3215 0.1731
temp: 298.150 k
press: 1.00000 atm
elementType: 16 8 8 8 8 8 7 7 7 6 6 6 6 6 6 6 6 6 6 6 1 1 1 1 1 1 1 1 1
symmnumber: 1
zpe: 502109.9 jmol-1
zpe.correction: 0.191244 hartree
zpe.thermalcorrener: 0.210132 hartree
zpe.thermalcorrenthalpy: 0.211076 hartree
zpe.thermalcorrgfe: 0.139848 hartree
zpe.sumelectzpe: -1361.238644 hartree
zpe.sumelectthermal: -1361.219756 hartree
zpe.sumelectthermalent: -1361.218812 hartree
zpe.sumelectthermalfe: -1361.290040 hartree
dipole: -4.6782 -1.6979 -1.2463
dipole: 5.1304
quadrupole: -120.9072 -135.9796 -123.9197
quadrupole: 18.9149 3.2063 -12.3453
quadrupole: 6.0283 -9.0441 3.0158 18.9149 3.2063 -12.3453
hfenergy: -1361.4298878 hartree
pointgroup: C01 [X(C11H9N3O5S1)]
dipole: 1.8572372 0.6518386 -0.447193 debye
polarizability: 315.5186416|36.8842406|213.6386053|12.5894959|33.5644981|141.7768575 unknown
InChI: InChI=1S/C11H9N3O5S/c15-14(16)9-3-5-11(6-4-9)20(17,18)13-12-8-10-2-1-7-19-10/h1-8,13H
charge 0 multiplicity 1
29 atoms
S  -0.270193 -2.483237 0.222059
O  -0.834033 -3.786187 -0.572237
O  0.280541 -2.548801 1.750661
O  5.193241 0.556465 -0.7914
O  -5.338401 1.904617 -0.985797
O  -4.451715 2.853329 0.889722
N  1.056639 -1.755643 -1.037258
N  1.81672 -0.779046 -0.45257
N  -4.479948 1.945015 -0.024817
C  -1.553859 -1.105694 0.134839
C  -2.490451 -1.150304 -0.910548
C  -1.528008 -0.120693 1.134945
C  -3.44942 0.869184 0.032093
C  -3.466718 -0.134508 -0.961742
C  -2.504749 0.895364 1.081009
C  3.866696 0.468258 -0.293923
C  3.074984 -0.607511 -0.83217
C  3.660215 1.487424 0.639472
C  4.888695 2.231288 0.73626
C  5.792115 1.642738 -0.140233
H  -2.465245 -1.96039 -1.64563
H  -0.781012 -0.161216 1.933054
H  -4.228275 -0.106448 -1.74481
H  -2.545405 1.694798 1.82489
H  1.537892 -2.600468 -1.433327
H  3.56673 -1.242594 -1.592074
H  2.733471 1.663738 1.180146
H  5.082125 3.092607 1.372254
H  6.824768 1.843615 -0.41127
