program: Gaussian 09
title: 000221314
version: EM64L-G09RevD.01
frameworkgroup: C1[X(C11H13NO3)]
method: RPBEPBE
basis: SDD
operation: Freq
keyword: #p
keyword: freq=noraman
keyword: PBEPBE/SDD
title: #p freq=noraman PBEPBE/SDD
converged: YES YES NO NO
title: Mulliken charges:
elementType: O O O N C C C C C C C C C C C H H H H H H H H H H H H H
charge: -0.272743 -0.298415 -0.294150 -0.388821 -0.353360 -0.302187 0.216975 0.234362 -0.338851 -0.331151 0.253965 -0.215850 -0.214436 -0.218725 -0.768855 0.266629 0.236783 0.235889 0.226936 0.362191 0.269640 0.270796 0.236376 0.234658 0.235610 0.248598 0.249017 0.219118
chargesum: 0.00000
title: Mulliken charges with hydrogens summed into heavy atoms:
elementType: O O O N C C C C C C C C C C C
charge: -0.272743 -0.298415 -0.294150 -0.026630 0.150052 0.160638 0.216975 0.234362 -0.069211 -0.060355 0.253965 0.020526 0.020222 0.016885 -0.052122
polarizability: 2.02661241e+02 -2.98760875e+00 1.36896729e+02 1.11796848e+01 5.26140661e+00 7.24325569e+01
1716.lowfreq: -3.3718 -0.0009 -0.0007 0.0003 6.9484 7.8487 21.1675 45.4602 55.1235
frequency: 20.8650 45.3615 55.1072 72.3232 87.5053 101.9114 118.5547 165.0073 168.3338 222.6910 276.3008 298.3304 363.4599 403.1620 425.3800 439.3983 458.3554 480.2220 589.6532 596.0920 614.0173 657.0122 681.8350 701.3708 749.8657 757.7930 796.9868 815.8506 865.5002 871.9821 931.4132 957.0401 990.5748 994.8277 997.3371 1010.5448 1014.4763 1025.5105 1043.0277 1059.8430 1076.9087 1091.5448 1134.9655 1175.3166 1183.3726 1214.0477 1242.6485 1263.8540 1288.4525 1315.6989 1349.0911 1361.9176 1387.3213 1391.1967 1438.5982 1446.1657 1452.9528 1466.1469 1467.1569 1478.1031 1491.2113 1581.5208 1608.8486 1612.4132 1614.5178 2976.0952 2997.0052 3028.3878 3043.0479 3095.7748 3103.3712 3117.1727 3132.8616 3145.3159 3157.6347 3169.1434 3180.5339 3466.6847
redmass: 5.5034 3.9942 4.0565 4.6484 1.2095 5.7595 3.7883 5.2994 3.0885 4.8321 4.1738 3.2218 5.0753 2.8226 2.9812 3.0277 5.1062 3.5178 3.3604 3.7752 6.4427 5.6885 4.9060 1.5954 1.1997 3.7606 2.1922 3.5158 1.2448 2.9018 3.6504 1.4169 6.2141 1.5672 1.3879 1.3317 2.8990 2.2000 1.6681 2.6305 2.3511 2.1485 3.4120 1.0583 1.1218 1.1123 1.9842 1.9133 1.5995 1.3172 1.3669 1.3415 1.2369 10.0349 2.2423 1.1076 1.0477 1.0955 1.0974 2.2467 2.0142 6.5516 7.3161 6.7137 5.7553 1.0642 1.0356 1.0651 1.0923 1.0981 1.1010 1.1056 1.0857 1.0892 1.0939 1.0978 1.0979 1.0800
irintensity: 0.5269 0.9040 3.9115 6.8806 5.0415 1.1925 5.1278 0.8890 2.2022 5.0776 24.2479 0.1255 2.8844 0.0212 8.9745 2.6605 8.3856 4.7555 8.8688 8.7158 0.4471 10.3594 7.5364 84.0066 118.7273 17.4829 15.9720 5.2919 0.0301 9.1678 2.2094 4.1721 2.3605 4.2355 0.0249 0.3138 9.2234 75.8127 14.7045 112.8233 70.1531 76.8366 10.3613 0.6169 44.7702 78.7623 148.1955 151.4338 70.0782 2.1832 11.8568 6.9588 64.1860 4.1170 20.1218 17.5211 15.4833 40.8310 80.8563 23.1905 466.9718 42.9835 57.6308 43.9766 209.3319 34.9942 10.1040 16.8840 20.9873 12.2153 22.2404 14.5016 0.2113 10.0959 15.0051 17.9905 8.8280 276.7164
temp: 298.150 k
press: 1.00000 atm
elementType: 8 8 8 7 6 6 6 6 6 6 6 6 6 6 6 1 1 1 1 1 1 1 1 1 1 1 1 1
symmnumber: 1
zpe: 584207.2 jmol-1
zpe.correction: 0.222513 hartree
zpe.thermalcorrener: 0.237161 hartree
zpe.thermalcorrenthalpy: 0.238105 hartree
zpe.thermalcorrgfe: 0.178560 hartree
zpe.sumelectzpe: -706.309034 hartree
zpe.sumelectthermal: -706.294385 hartree
zpe.sumelectthermalent: -706.293441 hartree
zpe.sumelectthermalfe: -706.352986 hartree
dipole: -5.4967 0.2546 0.6805
dipole: 5.5445
quadrupole: -98.4675 -78.5163 -90.4247
quadrupole: 5.5286 7.8048 -1.6562
quadrupole: -9.3313 10.6199 -1.2885 5.5286 7.8048 -1.6562
hfenergy: -706.5315463 hartree
pointgroup: C01 [X(C11H13N1O3)]
dipole: -2.1672562 0.2416225 -0.0545905 debye
polarizability: 202.4833164|10.5154534|79.3910688|-6.6015479|20.5060907|130.1161422 unknown
InChI: InChI=1S/C11H13NO3/c1-9(13)12-7-8-15-11(14)10-5-3-2-4-6-10/h2-6,12H,7-8H2,1H3
charge 0 multiplicity 1
28 atoms
O  0.050505 0.66259 1.266355
O  0.227155 -0.023014 -0.956364
O  5.149803 -0.62108 0.444871
N  2.88931 -0.468982 -0.093366
C  2.48768 -0.082404 1.262508
C  1.489956 1.086714 1.290514
C  -1.933512 -0.108569 0.168696
C  -0.473352 0.16801 0.076427
C  -2.585554 -0.638906 -0.975783
C  -2.672596 0.141628 1.354963
C  4.214632 -0.705888 -0.41366
C  -3.966613 -0.917102 -0.933508
C  -4.054266 -0.139371 1.391472
C  -4.702916 -0.66825 0.249811
C  4.478246 -1.078288 -1.870173
H  3.417029 0.207127 1.788952
H  2.05557 -0.937114 1.82211
H  1.671516 1.780616 0.449994
H  1.54974 1.62532 2.248775
H  2.145395 -0.49861 -0.800509
H  -1.99516 -0.82264 -1.879322
H  -2.158949 0.55064 2.229245
H  -4.468978 -1.326226 -1.816421
H  -4.62571 0.052614 2.305818
H  -5.776463 -0.885258 0.281986
H  5.227835 -0.385194 -2.288972
H  4.913882 -2.092029 -1.909641
H  3.571314 -1.054129 -2.498179
