program: Gaussian 09
title: 000221317
version: EM64L-G09RevD.01
frameworkgroup: C1[X(C17H15NO5)]
method: RPBEPBE
basis: SDD
operation: Freq
keyword: #p
keyword: freq=noraman
keyword: PBEPBE/SDD
title: #p freq=noraman PBEPBE/SDD
converged: YES YES NO NO
title: Mulliken charges:
elementType: O O O O O N C C C C C C C C C C C C C C C C C H H H H H H H H H H H H H H H
charge: -0.437921 -0.198545 -0.208615 -0.188744 -0.204683 0.122020 -0.218891 -0.321184 -0.564120 0.502106 0.187671 0.156978 -0.418136 -0.335051 0.272843 -0.223669 -0.232603 -0.231984 -0.332658 -0.345294 -0.248447 -0.229841 -0.220870 0.313930 0.280021 0.265861 0.260083 0.234771 0.249410 0.230829 0.231404 0.233470 0.248525 0.279149 0.384491 0.234691 0.236530 0.236476
chargesum: 0.00000
title: Mulliken charges with hydrogens summed into heavy atoms:
elementType: O O O O O N C C C C C C C C C C C C C C C C C
charge: -0.053430 -0.198545 -0.208615 -0.188744 -0.204683 0.122020 0.095038 -0.041163 -0.038177 0.502106 0.187671 0.156978 -0.183365 -0.085641 0.272843 0.007160 -0.001199 0.001486 -0.084133 -0.066145 -0.013756 0.006689 0.015606
polarizability: 2.84218586e+02 -2.97097009e+01 1.72359336e+02 5.66698286e-02 2.31797035e+01 1.56370834e+02
1716.lowfreq: -5.4674 -2.7747 -0.0007 -0.0006 0.0006 3.4780 17.7335 25.9061 31.8278
frequency: 17.6996 25.8995 31.8269 37.8683 40.5998 49.3749 74.1235 79.8424 88.7924 126.9462 139.9187 149.0843 191.8297 195.6041 219.3725 263.2909 269.6331 317.1934 342.0911 398.9577 401.8064 412.1971 417.9791 460.4727 491.1029 524.5906 536.4864 566.0289 587.3954 606.9872 613.5015 615.2895 641.8777 664.8554 689.1374 695.9912 699.2153 711.9215 763.7924 766.5693 786.2133 803.9048 836.7524 849.6202 857.0421 858.9146 924.3362 931.5899 953.7843 978.3241 987.9769 990.7789 991.2084 992.8620 1000.3939 1012.3023 1025.4071 1027.6595 1053.5315 1064.7934 1087.5106 1092.5577 1105.4150 1174.7089 1175.9158 1182.5980 1190.0569 1194.1649 1201.3819 1207.6939 1214.0890 1236.5757 1267.3306 1290.3154 1303.3651 1316.5637 1326.3554 1348.1395 1351.3874 1388.3732 1388.9669 1416.9461 1435.5642 1437.8271 1446.2593 1480.8959 1483.8101 1568.8174 1595.4540 1598.2059 1611.7226 1612.6361 1678.8022 2989.3049 3047.2586 3066.5877 3080.9035 3125.2168 3131.4186 3134.4263 3140.8068 3146.0797 3151.2721 3157.1821 3160.5705 3170.5000 3171.2080 3528.4876
redmass: 6.3240 4.1654 5.4142 6.0845 10.2455 6.1166 6.3022 7.8130 6.3806 9.5996 6.4802 5.3891 4.2826 5.9667 5.4021 5.1498 4.2616 7.9805 7.5860 2.8002 2.7834 3.2179 5.6052 6.2190 3.9339 2.9572 4.6582 2.4454 2.9059 2.7145 5.9431 5.2507 4.0153 6.2894 5.0570 1.8400 2.0111 3.2139 1.9967 2.6459 5.1970 3.2880 4.2477 1.2600 4.4278 1.2760 1.9256 1.5132 1.6667 1.3975 4.8485 5.6628 6.1127 1.3838 1.3342 1.3472 2.4074 2.1156 3.4452 2.4575 1.6003 1.7517 2.3467 1.0693 1.0708 1.4324 1.1376 1.1780 2.5012 1.8957 1.3985 2.3708 2.2422 2.3655 1.3564 1.3824 1.3380 1.7546 1.3336 6.5028 9.0394 1.5441 2.2965 2.1783 2.1279 2.2257 2.2515 6.9639 6.0004 6.8562 6.0380 6.3914 9.2992 1.0599 1.0974 1.0865 1.0861 1.0871 1.0853 1.0874 1.0880 1.0916 1.0924 1.0963 1.0963 1.1014 1.1015 1.0642
irintensity: 1.7659 0.2166 0.2345 0.2490 0.3941 1.4268 3.5641 3.6667 1.6536 0.9297 2.8544 0.0450 3.5284 3.0479 0.4451 2.3862 5.9408 9.9733 0.1983 0.0439 0.0523 0.5303 4.7878 3.7871 9.4290 20.8090 38.1431 43.0558 9.4973 100.3321 9.0679 8.5823 20.2210 5.8051 6.6780 42.1843 60.4594 57.4681 55.3638 13.1123 7.0136 13.0016 16.4459 0.3091 1.1944 0.1491 63.9252 10.0262 21.6800 0.0535 23.5161 27.6869 10.1528 0.4108 0.5210 0.3999 5.7716 0.8728 4.2138 84.7153 15.3829 2.5747 69.8266 3.5582 0.7615 17.9574 26.5452 4.5401 23.1688 19.2650 12.8326 171.0975 52.3659 63.1573 1.6040 4.0683 22.5748 79.8831 1.3086 3.8538 4.3899 22.6893 58.6033 49.6189 20.0103 2.5618 8.6361 109.4203 0.6723 45.1211 0.1357 8.0144 225.1442 18.7143 3.2423 0.6102 2.7860 3.5817 0.2440 0.5937 5.1486 17.8495 16.0647 24.7396 18.6384 17.5006 20.2232 34.2244
temp: 298.150 k
press: 1.00000 atm
elementType: 8 8 8 8 8 7 6 6 6 6 6 6 6 6 6 6 6 6 6 6 6 6 6 1 1 1 1 1 1 1 1 1 1 1 1 1 1 1
symmnumber: 1
zpe: 750454.4 jmol-1
zpe.correction: 0.285833 hartree
zpe.thermalcorrener: 0.306684 hartree
zpe.thermalcorrenthalpy: 0.307628 hartree
zpe.thermalcorrgfe: 0.232175 hartree
zpe.sumelectzpe: -1085.963671 hartree
zpe.sumelectthermal: -1085.942821 hartree
zpe.sumelectthermalent: -1085.941876 hartree
zpe.sumelectthermalfe: -1086.017329 hartree
dipole: -1.7966 -0.1611 2.8268
dipole: 3.3533
quadrupole: -96.4524 -148.9030 -128.6436
quadrupole: -8.4345 1.1049 -1.9289
quadrupole: 28.2139 -24.2367 -3.9773 -8.4345 1.1049 -1.9289
hfenergy: -1086.2495043 hartree
pointgroup: C01 [X(C17H15N1O5)]
dipole: -0.7000615 -0.145527 -1.1087158 debye
polarizability: 282.9797167|31.3523053|181.0810319|-5.1477604|19.0432069|148.8880069 unknown
InChI: InChI=1S/C17H15NO5/c19-15(12-7-3-1-4-8-12)11-14(17(20)21)16(18(22)23)13-9-5-2-6-10-13/h1-10,14,16,20H,11H2
charge 0 multiplicity 1
38 atoms
O  0.217883 1.467122 -2.079839
O  1.23792 2.636503 -0.346098
O  -1.840497 1.899478 0.304386
O  1.430364 -3.099615 -0.145868
O  1.160918 -1.861023 1.749737
N  1.361494 -1.983949 0.485548
C  0.430952 0.320399 0.036339
C  1.559497 -0.680901 -0.352193
C  -0.96053 -0.301496 -0.216616
C  2.984669 -0.188688 -0.146404
C  0.660846 1.611962 -0.750346
C  -2.100984 0.685731 0.050709
C  3.9004 -0.271772 -1.223901
C  3.412904 0.343965 1.095561
C  -3.513601 0.191362 -0.005415
C  5.228675 0.181701 -1.068155
C  4.741623 0.789845 1.251575
C  5.65192 0.712555 0.171346
C  -3.839533 -1.152768 -0.334967
C  -4.561665 1.110444 0.277373
C  -5.187211 -1.567353 -0.380744
C  -5.906007 0.694476 0.234426
C  -6.22231 -0.646345 -0.095257
H  0.535208 0.587836 1.100771
H  1.420089 -1.022535 -1.391239
H  -1.039489 -0.646928 -1.266235
H  -1.092685 -1.189106 0.430523
H  3.5735 -0.688548 -2.184135
H  2.717111 0.403482 1.938893
H  5.929106 0.11871 -1.907848
H  5.06671 1.201245 2.213062
H  6.68239 1.063153 0.295719
H  -3.050452 -1.878385 -0.557791
H  -4.29105 2.141508 0.528164
H  0.377922 2.318116 -2.569333
H  -5.431477 -2.604024 -0.635974
H  -6.70734 1.407357 0.456335
H  -7.268273 -0.971013 -0.128511
