program: Gaussian 09
title: 000221301
version: EM64L-G09RevD.01
frameworkgroup: C1[X(C14H21NO)]
method: RPBEPBE
basis: SDD
operation: Freq
keyword: #p
keyword: freq=noraman
keyword: PBEPBE/SDD
title: #p freq=noraman PBEPBE/SDD
converged: YES YES NO NO
title: Mulliken charges:
elementType: O N C C C C C C C C C C C C C C H H H H H H H H H H H H H H H H H H H H H
charge: -0.255288 -0.260129 -0.400823 -0.339804 -0.333397 0.178715 -0.500487 0.482544 -0.358039 -0.694778 -0.331224 -0.394302 -0.691953 -0.222627 -0.219611 -0.248461 0.228754 0.216605 0.214007 0.195667 0.193596 0.195627 0.225407 0.221959 0.228131 0.214156 0.218390 0.212517 0.215872 0.265734 0.231247 0.203391 0.224039 0.204804 0.226376 0.224751 0.228635
chargesum: 0.00000
title: Mulliken charges with hydrogens summed into heavy atoms:
elementType: O N C C C C C C C C C C C C C C
charge: -0.255288 -0.260129 0.044535 0.069870 0.055825 0.178715 -0.053121 0.482544 0.084248 -0.047999 -0.065490 -0.163055 -0.059719 0.003749 0.005140 -0.019825
polarizability: 2.04905485e+02 -1.99197715e+00 1.43499134e+02 3.91519291e-01 -1.58190754e+01 1.33274429e+02
1716.lowfreq: -7.4032 -6.2725 -0.0007 -0.0005 0.0008 13.3219 24.4888 33.1954 47.7398
frequency: 24.3761 32.9814 47.7364 56.4957 63.0980 69.0497 98.1778 102.4842 132.7188 167.7606 202.1813 230.5938 236.0218 241.8950 271.3915 332.3906 361.2034 381.4132 383.8982 407.8771 444.9489 503.8457 566.7779 579.7771 614.6337 649.9226 696.4798 731.7864 742.8919 746.4030 768.4669 785.1055 836.4334 854.5772 876.6172 900.2610 910.6163 912.0468 943.9974 966.3365 986.5026 990.6511 1010.3708 1026.4352 1052.5326 1070.9265 1078.2452 1088.5936 1098.8511 1111.5729 1114.5598 1134.7628 1172.0840 1187.8225 1205.1488 1219.2069 1222.6351 1262.8435 1265.1748 1280.6901 1285.7102 1293.8048 1317.4211 1338.9712 1342.8298 1359.6511 1370.3748 1381.6890 1390.6315 1392.1185 1438.7115 1441.3981 1467.7734 1470.4870 1473.4099 1478.0613 1478.6191 1482.8781 1484.5079 1485.7738 1494.0560 1581.3134 1594.8283 1611.9345 2960.1284 2962.0236 2969.2321 2974.9764 2978.6049 3004.6406 3009.4476 3012.5302 3022.8991 3037.4121 3047.0540 3071.1322 3072.7909 3075.0312 3079.6634 3084.0291 3125.1439 3134.8264 3147.2342 3162.8742 3185.3932
redmass: 3.3665 4.0983 3.3974 1.6664 3.4058 1.9213 3.1094 3.2010 2.3945 3.3895 3.5832 1.1250 1.1494 3.2998 4.4764 3.9701 3.3431 3.4939 3.2324 2.8836 3.7131 3.3257 3.0748 4.8220 6.2407 4.2987 1.7835 1.1326 1.1637 3.5365 1.9227 1.3048 1.2741 2.6236 1.3739 1.7180 1.5064 1.5060 1.4920 1.3777 1.7999 2.7052 4.1312 2.2772 2.4622 2.4493 1.8562 1.5300 2.3130 2.3058 2.5772 1.9298 1.0494 1.1429 1.7888 2.4626 1.3583 1.2875 1.6320 1.2933 1.0751 1.1695 1.3400 1.5209 1.5234 1.4252 2.1442 7.5418 1.2225 1.2136 1.9014 1.2156 1.0720 1.0579 1.0735 1.0429 1.0419 1.9792 1.0979 1.1139 1.1039 7.5760 6.8628 6.4511 1.0598 1.0590 1.0364 1.0377 1.0586 1.0993 1.0730 1.0861 1.0630 1.1007 1.0994 1.1006 1.0984 1.0995 1.1026 1.1022 1.0847 1.0885 1.0942 1.0993 1.0962
irintensity: 0.1012 0.8955 0.6708 0.0212 0.7020 0.4288 0.1778 2.4026 1.3778 2.7002 1.4274 0.0307 0.2506 2.4120 1.3101 8.9287 1.5928 4.1139 0.3943 0.7670 4.9268 6.4422 0.8126 3.0870 0.5424 14.1697 50.1073 12.8593 6.8643 2.3075 48.9799 0.8807 1.0090 4.6481 0.4171 4.9458 9.2995 22.0257 0.8918 0.3207 0.1186 0.1345 2.4444 8.4507 4.5366 0.6850 18.5579 1.1509 19.9921 4.1458 18.1313 69.3422 0.1143 1.4473 58.7065 27.6036 2.9989 3.4351 31.5617 30.6740 4.6094 17.2851 5.1859 12.1612 7.7918 21.8911 156.5782 4.7501 6.4912 10.0160 12.6170 8.4385 1.8974 6.6814 4.8322 12.5800 13.7968 71.0323 11.7695 13.0377 16.1095 149.6934 45.0122 56.6829 17.9675 26.1462 41.2315 27.9318 32.2265 5.2210 15.2595 15.5146 33.6980 20.1222 6.2287 49.3410 51.4756 48.2038 71.3500 54.8130 3.0940 6.2301 35.3818 27.7386 2.3416
temp: 298.150 k
press: 1.00000 atm
elementType: 8 7 6 6 6 6 6 6 6 6 6 6 6 6 6 6 1 1 1 1 1 1 1 1 1 1 1 1 1 1 1 1 1 1 1 1 1
symmnumber: 1
zpe: 837561.2 jmol-1
zpe.correction: 0.319010 hartree
zpe.thermalcorrener: 0.336618 hartree
zpe.thermalcorrenthalpy: 0.337563 hartree
zpe.thermalcorrgfe: 0.271210 hartree
zpe.sumelectzpe: -674.841078 hartree
zpe.sumelectthermal: -674.823470 hartree
zpe.sumelectthermalent: -674.822525 hartree
zpe.sumelectthermalfe: -674.888878 hartree
dipole: -0.4679 3.9314 -1.0329
dipole: 4.0916
quadrupole: -88.9587 -107.2349 -93.1080
quadrupole: -1.4282 0.6403 -1.7589
quadrupole: 7.4751 -10.8010 3.3259 -1.4282 0.6403 -1.7589
hfenergy: -675.160088 hartree
pointgroup: C01 [X(C14H21N1O1)]
dipole: 0.0794114 -1.5708633 0.342729 debye
polarizability: 201.8928031|13.114601|147.457398|5.9214645|-14.4851051|132.3288466 unknown
InChI: InChI=1S/C14H21NO/c1-3-5-12-15(14(16)9-4-2)13-10-7-6-8-11-13/h6-8,10-11H,3-5,9,12H2,1-2H3
charge 0 multiplicity 1
37 atoms
O  -1.077998 2.154992 -0.418338
N  -0.123637 0.150996 0.322789
C  -0.27634 -1.272143 0.728848
C  -0.125393 -2.259561 -0.452632
C  -0.225566 -3.733092 0.003012
C  -1.224641 0.960388 -0.020381
C  -2.625017 0.339259 0.135587
C  1.22868 0.65744 0.183041
C  -3.73569 1.267989 -0.396756
C  -0.072027 -4.72825 -1.167212
C  1.638394 1.316517 -1.003522
C  2.160049 0.481508 1.237229
C  -5.138948 0.654244 -0.209003
C  2.963864 1.783505 -1.13041
C  3.488075 0.942258 1.100189
C  3.897481 1.59507 -0.084666
H  -1.25441 -1.412355 1.217986
H  0.490427 -1.505617 1.488994
H  0.851946 -2.0860 -0.944178
H  -0.90415 -2.050626 -1.21373
H  -1.200486 -3.899698 0.506027
H  0.556251 -3.934514 0.763915
H  -2.812262 0.123813 1.208597
H  -2.671262 -0.636413 -0.388483
H  -3.667286 2.242928 0.117963
H  -3.549515 1.480399 -1.465839
H  -0.141266 -5.77491 -0.818876
H  -0.859929 -4.572215 -1.92789
H  0.906127 -4.601886 -1.667751
H  0.916927 1.477217 -1.80779
H  1.845101 0.009207 2.17446
H  -5.233957 -0.310143 -0.744234
H  -5.922159 1.330915 -0.596453
H  -5.356531 0.467398 0.860225
H  3.267602 2.294916 -2.050627
H  4.196219 0.802267 1.924632
H  4.926025 1.957395 -0.18902
