program: Gaussian 09
title: 000221304
version: EM64L-G09RevD.01
frameworkgroup: C1[X(C16H30O4)]
method: RPBEPBE
basis: SDD
operation: Freq
keyword: #pfreq=noraman
keyword: PBEPBE/SDD
title: #p freq=noraman PBEPBE/SDD
converged: YES YES NO NO
title: Mulliken charges:
elementType: O O O O C C C C C C C C C C C C C C C C H H H H H H H H H H H H H H H H H H H H H H H H H H H H H H
charge: -0.269863 -0.257362 -0.243902 -0.252175 -0.013977 -0.467444 -0.402056 -0.372139 -0.427443 -0.385818 -0.388275 -0.371929 -0.343263 -0.353656 -0.356795 -0.696333 0.291024 0.290068 -0.757170 -0.759459 0.238966 0.212544 0.215873 0.212297 0.206384 0.193967 0.192925 0.236811 0.213404 0.190905 0.192487 0.244100 0.227410 0.190703 0.190218 0.223407 0.262899 0.188100 0.187556 0.195220 0.195319 0.209613 0.209636 0.215598 0.250351 0.249794 0.247975 0.246715 0.244795 0.251995
chargesum: 0.00000
title: Mulliken charges with hydrogens summed into heavy atoms:
elementType: O O O O C C C C C C C C C C C C C C C C
charge: -0.269863 -0.257362 -0.243902 -0.252175 0.224989 -0.039027 0.016625 0.014754 0.022771 -0.002426 0.083235 0.008992 0.143043 0.021999 0.033744 -0.061486 0.291024 0.290068 -0.009050 -0.015954
polarizability: 2.21554169e+02 -3.42595048e+00 1.87681414e+02 -6.86948408e-01 -4.35582256e+00 1.56888943e+02
1716.lowfreq: -41.5108 -33.8653 -8.3541 -0.0010 -0.0006 0.0009 2.6013 7.3968 13.8960
frequency: -41.4815 -33.8244 13.8135 25.1115 27.3351 31.2244 36.9153 46.0800 52.5248 61.2579 67.2445 83.6389 88.0839 94.5774 110.7240 121.8990 135.6797 143.4666 168.3596 186.3760 233.5694 254.2109 273.1607 281.3871 289.1084 307.7320 314.7906 375.7055 412.8279 430.0665 441.0628 466.9463 475.3594 573.8988 577.6277 586.8437 621.9695 647.3122 719.2677 724.9564 740.9535 760.9679 774.1357 783.1205 807.9440 846.6541 877.9069 887.8290 921.1339 928.4867 945.1772 949.3233 975.7683 996.0210 998.1684 1000.9826 1003.4147 1028.8995 1038.1840 1045.4603 1047.4057 1048.7467 1061.6222 1079.0475 1081.0342 1094.2932 1120.3906 1148.5999 1162.4720 1187.6869 1190.4288 1198.0543 1206.3646 1212.7519 1227.6750 1243.0680 1262.4798 1267.3206 1271.2176 1279.5824 1283.9566 1291.2201 1292.7773 1297.7941 1303.0790 1317.4846 1334.0515 1349.7473 1352.5991 1353.4071 1359.8009 1367.0036 1376.2295 1384.8210 1385.0637 1388.7707 1446.8626 1455.1063 1456.0331 1456.7326 1458.9581 1459.1313 1459.3603 1460.2271 1463.0708 1465.2120 1471.3564 1475.0093 1477.1932 1479.4979 1485.1659 1488.7252 1641.6701 1646.7767 2949.8492 2950.0685 2953.1321 2957.9515 2961.1473 2967.3512 2968.9802 2971.3386 2982.9055 2983.1228 2989.5519 2991.2136 2999.8049 3007.8633 3008.0006 3010.0511 3018.9999 3021.9769 3024.3483 3034.8800 3044.4957 3050.1232 3067.8891 3070.2614 3095.8162 3095.8537 3098.0998 3129.2022 3138.3140 3138.7944
redmass: 1.0791 1.0509 4.8980 4.0338 5.5748 4.7441 1.7295 3.7908 4.2634 4.0007 2.9272 1.8633 2.8631 2.9987 2.7580 3.7784 1.8347 2.1768 3.5557 3.9200 1.1101 3.7440 3.0616 2.9949 3.7133 3.1907 3.0893 2.9860 2.4320 3.5215 3.0680 3.1364 2.8794 3.6369 3.3281 3.6852 4.5098 4.3624 1.0608 1.0805 1.1311 1.8513 2.9721 1.3054 1.9017 1.2687 3.4510 1.9072 1.3942 2.2029 4.4877 3.5755 2.0259 1.3565 3.5219 1.9049 1.9435 2.6062 1.6694 1.6709 1.6797 2.7228 2.8358 2.4100 2.1525 2.3110 2.7702 2.4077 1.9981 2.5540 1.8288 2.8569 1.4742 1.3680 1.3978 1.3199 1.2557 1.2417 1.2239 1.0285 1.1623 1.1038 1.1469 1.1502 1.2024 1.2661 1.3845 1.4452 1.5973 1.6214 1.4904 1.3155 1.3221 1.2367 1.2390 1.2166 1.0893 1.0676 1.0739 1.0815 1.0473 1.0744 1.0605 1.0735 1.0665 1.0793 1.0823 1.0866 1.0425 1.0827 1.0898 1.0922 9.6334 9.6532 1.0586 1.0587 1.0591 1.0597 1.0605 1.0601 1.0595 1.0370 1.0873 1.0844 1.0893 1.0723 1.0990 1.0366 1.0365 1.1023 1.0615 1.1012 1.0642 1.1041 1.1038 1.1006 1.1007 1.0993 1.0970 1.0972 1.1074 1.1034 1.1012 1.1011
irintensity: 1.6524 1.2546 0.1421 0.0843 1.5480 1.0132 0.2451 0.1067 1.2561 2.9433 1.5782 0.2027 0.4078 0.7152 0.6094 0.4147 0.0569 0.0387 0.1713 1.4355 0.0026 8.0289 4.4768 9.9035 5.0443 7.6384 0.1702 7.5368 1.6192 2.3001 1.4291 3.3443 3.6828 1.2160 2.9954 13.6048 5.4290 3.5103 15.5151 0.1441 6.9622 12.7730 20.1165 2.9121 0.2431 2.2606 3.5217 5.0196 8.2734 4.4187 70.0265 50.5205 21.0027 1.5540 4.7849 67.7565 33.0174 4.0065 3.8865 9.5766 7.4184 8.1242 7.0595 0.1667 0.4690 8.8186 7.8663 4.4413 17.4369 278.0916 54.0368 265.0280 84.1899 29.4199 0.0212 2.1387 0.8918 13.8511 15.1516 0.8239 1.3525 0.6805 1.6089 2.5019 0.9806 2.5805 1.0776 2.5013 1.8499 0.1964 1.5913 0.0777 5.5538 43.9359 62.0994 11.2951 9.0376 11.4086 23.5203 8.7338 16.6589 1.8323 10.2839 2.4595 1.2304 1.3889 5.5937 6.4768 12.2055 6.0615 1.9108 29.4342 110.1411 231.7334 0.2315 0.3922 0.2738 10.3437 12.2893 7.3989 206.3768 34.0354 7.4853 6.8571 6.3843 20.4829 1.5455 2.6051 3.9749 0.3883 26.6677 4.5593 34.2150 15.1127 208.5288 19.9466 97.0166 55.5853 7.0705 7.6513 12.8692 9.1830 9.4421 9.8797
temp: 298.150 k
press: 1.00000 atm
elementType: 8 8 8 8 6 6 6 6 6 6 6 6 6 6 6 6 6 6 6 6 1 1 1 1 1 1 1 1 1 1 1 1 1 1 1 1 1 1 1 1 1 1 1 1 1 1 1 1 1 1
symmnumber: 1
zpe: 1142841.4 jmol-1
zpe.correction: 0.435285 hartree
zpe.thermalcorrener: 0.459570 hartree
zpe.thermalcorrenthalpy: 0.460515 hartree
zpe.thermalcorrgfe: 0.375474 hartree
zpe.sumelectzpe: -926.977234 hartree
zpe.sumelectthermal: -926.952949 hartree
zpe.sumelectthermalent: -926.952005 hartree
zpe.sumelectthermalfe: -927.037046 hartree
dipole: -0.4562 0.6610 -2.5009
dipole: 2.6267
quadrupole: -117.5788 -124.8454 -131.8899
quadrupole: -1.4346 -9.6481 0.8304
quadrupole: 7.1926 -0.0740 -7.1185 -1.4346 -9.6481 0.8304
hfenergy: -927.4125195 hartree
pointgroup: C01 [X(C16H30O4)]
dipole: -0.0900796 -0.2220093 1.0052592 debye
polarizability: 218.0001793|10.8985275|190.4588133|-0.3913244|-6.7877661|157.6655324 unknown
InChI: InChI=1S/C16H30O4/c1-4-5-6-7-8-9-10-16(13-20-15(3)18)11-12-19-14(2)17/h16H,4-13H2,1-3H3
charge 0 multiplicity 1
50 atoms
O  2.1808 2.839773 0.535319
O  3.902055 -1.230188 0.71309
O  1.736412 4.2376 -1.282217
O  4.238031 -2.04925 -1.44787
C  1.015953 0.971075 -0.694679
C  -0.387667 0.574652 -1.241581
C  -1.391783 0.0353 -0.194642
C  -2.764023 -0.304553 -0.81917
C  1.762659 -0.254004 -0.099529
C  -3.785599 -0.851239 0.203251
C  0.875753 2.14283 0.302013
C  -5.162381 -1.171655 -0.421524
C  3.258792 -0.003379 0.144156
C  -6.186716 -1.718962 0.598002
C  -7.56581 -2.030678 -0.027096
C  -8.583842 -2.574894 0.998521
C  2.493576 3.88054 -0.351206
C  4.34511 -2.185968 -0.206507
C  3.839241 4.488287 -0.019016
C  4.962766 -3.37294 0.502265
H  1.595295 1.350247 -1.562159
H  -0.247528 -0.191995 -2.030297
H  -0.832114 1.458901 -1.742648
H  -0.981841 -0.872961 0.291015
H  -1.542121 0.783194 0.611015
H  -2.621659 -1.049461 -1.630058
H  -3.180443 0.603951 -1.302805
H  1.665759 -1.102025 -0.804156
H  1.290638 -0.560737 0.853521
H  -3.918733 -0.11135 1.020428
H  -3.375816 -1.76748 0.677847
H  0.153141 2.887084 -0.078511
H  0.582579 1.802031 1.308637
H  -5.030082 -1.909875 -1.240213
H  -5.571619 -0.25429 -0.894526
H  3.772655 0.259108 -0.798815
H  3.43759 0.769113 0.905199
H  -5.782036 -2.640016 1.067828
H  -6.316927 -0.983338 1.419499
H  -7.968487 -1.110104 -0.497169
H  -7.435788 -2.766249 -0.847139
H  -8.755333 -1.844647 1.812044
H  -8.21774 -3.511074 1.461031
H  -9.560299 -2.790487 0.52677
H  4.272612 4.037916 0.885397
H  3.72362 5.576471 0.123318
H  4.526836 4.342787 -0.870848
H  6.002389 -3.505394 0.155685
H  4.409923 -4.289568 0.232016
H  4.948805 -3.239301 1.593314
