program: Gaussian 09
title: 000221300
version: EM64L-G09RevD.01
frameworkgroup: C1[X(C14H20O5)]
method: RPBEPBE
basis: SDD
operation: Freq
keyword: #pfreq=noraman
keyword: PBEPBE/SDD
title: #p freq=noraman PBEPBE/SDD
converged: NO YES NO NO
title: Mulliken charges:
elementType: O O O O O C C C C C C C C C C C C C C H H H H H H H H H H H H H H H H H H H H
charge: -0.262946 -0.284139 -0.202855 -0.233108 -0.201314 -0.137098 -0.300030 -0.330456 0.500227 -0.740841 0.177696 -0.529905 0.225851 0.217937 -0.832719 -0.227952 -0.224809 -0.673886 -0.682575 0.275424 0.235304 0.283228 0.220165 0.226137 0.234337 0.258375 0.224055 0.262290 0.240632 0.231777 0.225174 0.243889 0.236833 0.214549 0.231107 0.231184 0.216393 0.233000 0.219070
chargesum: 0.00000
title: Mulliken charges with hydrogens summed into heavy atoms:
elementType: O O O O O C C C C C C C C C C C C C C
charge: -0.262946 -0.284139 -0.202855 -0.233108 -0.201314 0.138326 -0.064727 -0.047228 0.500227 -0.060202 0.177696 -0.271530 0.225851 0.217937 -0.105742 0.228998 0.255913 0.002955 -0.014112
polarizability: 1.93733597e+02 -9.73003396e+00 1.58961396e+02 8.75765149e-01 2.52482163e+00 1.39773257e+02
1716.lowfreq: -13.2620 -0.0005 0.0005 0.0009 7.2487 8.9496 21.6520 30.5610 51.7727
frequency: 21.2908 30.2150 51.7484 58.8787 66.8481 83.3392 90.1667 103.9958 118.7639 123.8828 138.6859 154.1433 163.3482 196.2482 204.5718 210.1793 217.4222 252.7288 259.0952 262.8921 294.9975 316.9613 339.5092 375.5515 384.2960 421.3841 453.2519 469.1511 479.5660 543.2346 574.3310 608.9504 658.9406 665.6136 736.9056 759.7916 797.5850 801.1506 807.1090 816.9352 840.6417 878.0289 891.6017 912.0646 934.6239 950.4461 989.2467 1015.6020 1024.6249 1026.6039 1028.9328 1046.8244 1087.6409 1104.9741 1110.4021 1115.2097 1128.7380 1134.1505 1134.7341 1138.3848 1160.7872 1192.7202 1248.2198 1250.6901 1254.6952 1260.4695 1269.8271 1285.4931 1326.5892 1333.5961 1353.8632 1358.3910 1361.8984 1390.1621 1394.1946 1399.0744 1400.9612 1458.3783 1461.7714 1464.2231 1466.2145 1473.4694 1474.4156 1475.1141 1481.1126 1484.6401 1487.7883 1597.1348 1627.6464 1638.8760 1653.8988 2968.8985 2981.2763 2984.2051 2992.8632 2996.4422 3009.2364 3010.0561 3014.8866 3043.9845 3044.2282 3067.3029 3071.9430 3078.4056 3082.3350 3089.3390 3093.2649 3095.8767 3103.6888 3107.7336 3140.1573
redmass: 3.2664 4.2973 4.8405 2.8282 7.0173 3.6558 2.8219 3.4567 3.0076 2.3100 1.8842 2.1551 3.5411 2.3938 2.2311 1.3845 2.8626 1.4185 2.1349 1.6808 3.8840 5.9810 3.8610 3.6836 4.0269 4.5221 4.3002 4.3893 4.5979 4.9217 4.5025 4.6020 5.4345 4.5357 6.4396 5.2219 1.1035 1.1330 3.1004 3.3284 2.9474 4.8167 1.9166 2.0458 3.5530 3.0388 2.0139 1.7178 2.3974 2.0938 1.7024 1.7775 2.9272 3.0958 2.2763 2.3737 2.0850 2.0878 1.5129 1.8760 1.4609 2.9873 1.1549 1.1565 1.5549 1.8162 1.4525 1.4722 1.7562 1.7035 1.3811 1.3517 1.7471 1.2413 1.1972 1.2690 1.2602 1.0574 1.0423 1.0404 1.0679 1.0608 1.0456 1.0617 1.0527 1.0682 1.0686 10.2731 10.3324 10.4285 7.1516 1.0384 1.0363 1.0803 1.0359 1.0359 1.0820 1.0581 1.0585 1.0946 1.0876 1.1063 1.1051 1.0997 1.0988 1.0991 1.0986 1.0984 1.1028 1.1024 1.0923
irintensity: 0.1226 1.3923 1.6584 0.0644 0.3695 1.6556 1.1626 0.4962 2.0192 3.0870 0.1150 1.1302 0.5639 4.6563 3.9804 1.2934 2.3107 1.2015 0.8769 2.4128 10.8557 8.6053 9.2635 1.5028 6.7360 1.5390 3.2931 7.7191 5.4608 4.2979 10.2824 1.7942 9.7689 0.7846 3.1161 11.3348 1.6584 5.4716 0.2280 4.1945 4.7039 6.6568 24.7355 7.1427 4.0274 25.0914 5.4202 11.2923 32.6895 68.7158 14.6801 54.8423 112.1922 157.8374 34.6957 61.9131 25.1306 129.2271 21.9611 121.3608 12.8538 52.9967 2.3718 3.9348 59.8815 11.4597 90.2490 20.3456 23.1489 14.3786 1.7164 0.7363 8.6405 38.9094 13.1943 20.3088 24.4950 17.7718 14.3133 8.7331 16.8007 0.3010 6.9712 6.7433 3.6862 25.4863 1.2563 123.9309 36.6580 262.1396 146.6115 14.2384 24.4657 14.9151 20.6724 20.8525 3.9756 18.4358 12.3178 9.9418 3.0573 10.1642 0.6109 23.5497 28.1863 36.2474 27.0973 19.3123 48.8706 37.6121 7.5137
temp: 298.150 k
press: 1.00000 atm
elementType: 8 8 8 8 8 6 6 6 6 6 6 6 6 6 6 6 6 6 6 1 1 1 1 1 1 1 1 1 1 1 1 1 1 1 1 1 1 1 1
symmnumber: 1
zpe: 831820.8 jmol-1
zpe.correction: 0.316824 hartree
zpe.thermalcorrener: 0.338205 hartree
zpe.thermalcorrenthalpy: 0.339149 hartree
zpe.thermalcorrgfe: 0.265336 hartree
zpe.sumelectzpe: -920.138997 hartree
zpe.sumelectthermal: -920.117616 hartree
zpe.sumelectthermalent: -920.116672 hartree
zpe.sumelectthermalfe: -920.190484 hartree
dipole: 6.0831 -3.4150 2.0336
dipole: 7.2665
quadrupole: -116.9387 -105.5261 -115.3804
quadrupole: 13.2884 -1.3016 4.4965
quadrupole: -4.3236 7.0890 -2.7654 13.2884 -1.3016 4.4965
hfenergy: -920.4558207 hartree
pointgroup: C01 [X(C14H20O5)]
dipole: 2.2942165 -1.4993385 0.8134289 debye
polarizability: 191.3753963|-12.9755034|161.691934|-0.8913073|0.9668087|139.40092 unknown
InChI: InChI=1S/C14H20O5/c1-5-18-13(16)11-8(3)7-10(15)12(9(11)4)14(17)19-6-2/h7,9,11-12H,5-6H2,1-4H3
charge 0 multiplicity 1
39 atoms
O  1.879117 -1.622829 0.485829
O  0.889467 1.926441 0.142502
O  -3.659632 1.523958 0.521927
O  0.879098 -0.859878 -1.475434
O  -0.916732 2.233811 -1.29589
C  -0.569989 -0.071774 1.57394
C  -0.4910 -1.2838 0.57582
C  -1.266757 1.152999 0.913542
C  -1.740238 -1.468524 -0.283331
C  -1.307586 -0.486603 2.869182
C  -2.657742 0.767135 0.376896
C  -2.736986 -0.531051 -0.319676
C  0.783852 -1.21634 -0.279584
C  -0.45738 1.80939 -0.215641
C  -1.833056 -2.762009 -1.058153
C  3.213895 -1.562042 -0.188099
C  1.777837 2.540366 -0.896289
C  4.246368 -2.023398 0.834636
C  3.14424 2.742101 -0.249801
H  0.460668 0.221124 1.839664
H  -0.366558 -2.194256 1.197213
H  -1.414291 1.935568 1.683742
H  -0.758726 -1.294898 3.385504
H  -1.382854 0.368961 3.564754
H  -2.332955 -0.844143 2.664154
H  -3.661198 -0.717714 -0.879112
H  -1.704244 -3.640063 -0.395251
H  -1.026573 -2.806395 -1.815674
H  -2.797792 -2.856556 -1.582653
H  3.179329 -2.211028 -1.081783
H  3.382944 -0.52306 -0.524899
H  1.80456 1.847858 -1.756881
H  1.320541 3.489646 -1.227289
H  5.255406 -1.997935 0.38433
H  4.244984 -1.366959 1.721534
H  4.04076 -3.055709 1.165286
H  3.842059 3.184321 -0.984202
H  3.075493 3.422167 0.616326
H  3.568775 1.783222 0.09646
