program: Gaussian 09
title: 000221290
version: EM64L-G09RevD.01
frameworkgroup: C1[X(C12H14O)]
method: RPBEPBE
basis: SDD
operation: Freq
keyword: #pfreq=noraman
keyword: PBEPBE/SDD
title: #p freq=noraman PBEPBE/SDD
converged: YES YES NO NO
title: Mulliken charges:
elementType: O C C C C C C C C C C C C H H H H H H H H H H H H H H
charge: -0.221729 -0.081251 -0.224724 -0.556751 0.423391 0.108514 -0.730537 0.040815 -0.736390 -0.422444 -0.364816 -0.232054 -0.241012 0.205718 0.215828 0.248249 0.243169 0.218792 0.212433 0.232999 0.219481 0.228665 0.227962 0.239723 0.281050 0.230038 0.234881
chargesum: 0.00000
title: Mulliken charges with hydrogens summed into heavy atoms:
elementType: O C C C C C C C C C C C C
charge: -0.221729 0.124466 -0.008896 -0.065333 0.423391 0.108514 -0.066313 0.040815 -0.060283 -0.182721 -0.083765 -0.002015 -0.006132
polarizability: 1.54390877e+02 -3.78264911e+00 1.38522561e+02 6.84390448e+00 -4.07388658e+00 8.40492259e+01
1716.lowfreq: -13.5663 -9.0393 0.0004 0.0006 0.0010 14.0150 48.8681 103.6804 124.6879
frequency: 48.8203 103.6676 124.6831 166.3810 209.4124 227.4500 232.4452 277.4363 292.1248 349.9833 402.8755 420.0342 457.7038 471.1981 507.5651 541.7042 562.6833 593.4496 671.6849 726.7993 760.7440 774.7872 781.5026 821.0444 883.2002 898.0266 941.5733 976.4283 988.2066 994.9034 1004.9654 1016.2777 1037.1500 1053.8530 1061.6143 1095.7108 1120.3583 1144.7940 1172.2908 1182.8325 1208.8144 1238.8059 1255.2359 1281.2379 1292.1136 1329.2921 1336.4909 1357.5644 1387.0017 1388.8746 1392.5124 1434.1799 1439.8971 1470.6006 1472.3723 1475.7694 1481.2434 1485.1413 1571.1053 1587.4125 1617.0521 2969.6575 2972.8943 2976.4231 2977.4550 2987.7746 3056.6881 3071.4722 3074.6570 3075.9463 3079.3807 3115.9670 3134.5250 3148.1215 3164.2932
redmass: 3.8870 3.4114 3.9993 2.5838 1.1576 1.4391 1.5839 4.7605 2.8756 2.5319 3.2911 3.3335 5.1860 3.5791 4.3986 4.9028 2.9824 2.9573 5.1567 3.2864 3.2289 1.6544 2.1012 2.4861 1.8138 1.5731 1.8949 1.3937 2.0292 1.6915 1.3450 1.8621 2.1490 2.5524 1.8821 2.0770 1.6127 1.5635 1.1145 1.4183 1.7355 1.7808 2.7468 1.3333 1.7188 1.6393 1.4770 1.6025 4.0575 1.2871 1.2756 1.1006 2.2994 1.0905 2.0500 1.0477 1.0590 1.1283 8.1723 7.4370 7.2073 1.0776 1.0737 1.0372 1.0370 1.0786 1.0946 1.0995 1.0999 1.0994 1.0995 1.0873 1.0888 1.0933 1.1002
irintensity: 2.6401 0.6809 1.1478 0.6852 0.1811 0.1071 0.1076 3.3780 3.2595 1.4610 1.2605 1.5471 0.8536 0.2871 5.8219 8.5504 10.5531 1.7103 1.6618 6.9468 5.2468 49.2270 22.7301 1.9784 2.5513 0.3360 0.8482 1.7458 10.6126 5.5621 0.3772 15.6169 1.7825 1.2767 5.6472 4.6378 12.2703 9.1858 4.3923 9.2998 4.0202 8.4132 48.8929 10.9572 58.1529 9.6183 0.7585 14.6950 6.2988 5.0037 26.8336 19.8053 14.5719 13.2241 5.8048 11.9895 3.1096 7.9652 76.6120 101.0891 36.7536 7.3147 33.2286 24.7274 31.0396 43.8822 14.8670 22.2774 11.6585 83.0594 30.5369 7.5658 11.5188 9.9396 29.7431
temp: 298.150 k
press: 1.00000 atm
elementType: 8 6 6 6 6 6 6 6 6 6 6 6 6 1 1 1 1 1 1 1 1 1 1 1 1 1 1
symmnumber: 1
zpe: 594581.9 jmol-1
zpe.correction: 0.226464 hartree
zpe.thermalcorrener: 0.238113 hartree
zpe.thermalcorrenthalpy: 0.239058 hartree
zpe.thermalcorrgfe: 0.189244 hartree
zpe.sumelectzpe: -539.960233 hartree
zpe.sumelectthermal: -539.948583 hartree
zpe.sumelectthermalent: -539.947639 hartree
zpe.sumelectthermalfe: -539.997453 hartree
dipole: -0.0488 -3.9443 0.3458
dipole: 3.9597
quadrupole: -67.8150 -84.8514 -79.4920
quadrupole: 1.7308 1.0152 1.0414
quadrupole: 9.5711 -7.4652 -2.1058 1.7308 1.0152 1.0414
hfenergy: -540.1866968 hartree
pointgroup: C01 [X(C12H14O1)]
dipole: -0.0304778 -1.5571393 -0.0366093 debye
polarizability: 154.788571|3.7146822|138.5690169|5.7580011|0.3266873|83.605076 unknown
InChI: InChI=1S/C12H14O/c1-8-7-12(13)11-6-4-3-5-10(11)9(8)2/h3-6,8-9H,7H2,1-2H3
charge 0 multiplicity 1
27 atoms
O  0.629394 2.793578 0.258461
C  2.148372 -0.535423 -0.342741
C  0.982621 -1.45829 0.123068
C  2.072165 0.833911 0.379776
C  -0.371785 -0.761241 -0.006716
C  -0.488286 0.659214 0.07155
C  2.162956 -0.358185 -1.879903
C  0.720661 1.529691 0.228046
C  1.186679 -1.974486 1.576683
C  -1.552127 -1.525678 -0.177083
C  -1.765407 1.278005 -0.012097
C  -2.818307 -0.907449 -0.256523
C  -2.928107 0.503382 -0.170594
H  3.099109 -1.023757 -0.045969
H  0.971889 -2.348495 -0.539427
H  2.855104 1.526567 0.022564
H  2.246357 0.700082 1.467891
H  3.011032 0.277269 -2.194339
H  2.263129 -1.334942 -2.388557
H  1.234207 0.117642 -2.244744
H  2.150341 -2.50982 1.664886
H  1.183155 -1.146326 2.308148
H  0.378769 -2.670944 1.863931
H  -1.475728 -2.617591 -0.252655
H  -1.807783 2.370827 0.048749
H  -3.717381 -1.519817 -0.390198
H  -3.910226 0.984276 -0.232309
