program: Gaussian 09
title: 000019286
version: EM64L-G09RevD.01
frameworkgroup: C1[X(C22H26ClN2)]
method: RPBEPBE
basis: SDD
operation: Freq
keyword: #p
keyword: freq=noraman
keyword: PBEPBE/SDD
title: #p freq=noraman PBEPBE/SDD
converged: YES YES NO NO
title: Mulliken charges:
elementType: Cl N N C C C C C C C C C C C C C C C C C C C C C C H H H H H H H H H H H H H H H H H H H H H H H H H H
charge: -0.011493 -0.233630 -0.132375 -0.047920 0.339526 0.486745 0.228878 -0.684489 -0.684435 -0.413431 -0.397957 -0.345474 -0.654916 -0.237483 -0.216979 -0.282454 0.520665 -0.399528 -0.418107 0.417233 -0.341787 -0.360987 -0.398085 -0.655944 -0.579379 0.243995 0.238583 0.221165 0.243941 0.221821 0.238266 0.253750 0.243099 0.248157 0.258491 0.262983 0.262530 0.249820 0.250786 0.229854 0.230097 0.240570 0.250225 0.260636 0.269184 0.258394 0.258839 0.253872 0.251653 0.283502 0.279595
chargesum: 1.00000
title: Mulliken charges with hydrogens summed into heavy atoms:
elementType: Cl N N C C C C C C C C C C C C C C C C C C C C C C
charge: -0.011493 -0.233630 -0.132375 -0.047920 0.339526 0.486745 0.228878 0.019254 0.019593 -0.159681 -0.154858 -0.097317 0.129088 0.012337 0.033807 -0.052600 0.520665 -0.169431 -0.177537 0.417233 -0.091562 -0.100351 0.129492 0.108420 -0.016282
polarizability: 7.93974516e+02 -6.16419365e+01 2.64630629e+02 -1.29338776e+01 -9.92594563e+00 1.36423595e+02
1716.lowfreq: -5.5487 -2.6100 -0.0018 -0.0014 0.0010 0.8479 16.7373 24.1067 29.0693
frequency: 16.1567 24.0732 29.0258 46.0590 52.6882 66.4891 92.7804 92.9020 108.2621 127.8265 138.7777 144.3553 159.1333 170.9371 178.9797 186.2906 215.6383 228.9463 231.1121 241.7622 252.2253 277.2359 299.1892 318.5753 324.9246 341.4941 363.1575 389.7801 397.5086 423.8446 430.9225 467.1693 498.3419 509.9458 522.1097 539.1725 544.0414 565.1273 585.8155 616.9595 631.0212 678.4983 687.3451 702.3724 737.1282 744.8947 753.4660 766.5470 779.4243 791.6156 803.6136 819.0790 830.8593 854.6411 867.6425 882.3666 927.2149 936.8428 940.2265 947.2318 950.4743 967.6173 977.1437 985.6616 995.4553 1011.9225 1015.4797 1021.7314 1037.6620 1041.8451 1075.3184 1085.1797 1104.5353 1114.4758 1118.3894 1129.2332 1130.2796 1138.6154 1174.9166 1184.2428 1185.6215 1209.5943 1222.7023 1228.1542 1246.9425 1259.8441 1279.0822 1281.8190 1283.8393 1304.3165 1318.5865 1335.4288 1349.6457 1371.3204 1381.2401 1388.7406 1397.0299 1407.0724 1416.2366 1438.6921 1446.5478 1451.4644 1459.5964 1460.5701 1462.4047 1464.2526 1474.8044 1476.7442 1477.7528 1477.9514 1479.9667 1486.9278 1490.1192 1502.9531 1515.0946 1530.8388 1542.7486 1594.9277 1608.7805 1622.6932 1640.4632 2980.1096 2997.5537 2998.6387 3003.1127 3036.9831 3060.8797 3062.7336 3087.7041 3093.5553 3096.8013 3100.2699 3100.7148 3103.1624 3120.8732 3128.2893 3130.3128 3139.9643 3141.8326 3143.8179 3144.8496 3145.5459 3150.7244 3162.9881 3173.8783 3179.9350 3182.4827
redmass: 5.0892 8.6438 4.5103 4.3071 4.0223 3.2600 1.2677 3.3141 2.6726 2.1908 3.4383 3.5606 2.2317 1.4022 3.1960 1.4611 1.0521 4.3427 2.8874 2.5928 3.2232 2.9528 2.8908 3.2476 3.1653 3.8795 3.5448 3.4970 3.6130 3.9991 3.0552 3.3945 3.2080 4.5867 2.4538 4.6834 4.1898 3.4877 4.2265 4.5539 6.3095 4.4092 6.1115 5.5635 4.3438 3.7668 2.5985 1.5957 4.3672 1.1472 1.2907 2.5867 1.7157 4.4521 1.3899 1.8765 2.5806 3.0752 1.4310 1.2552 1.3784 1.3476 1.3700 2.9508 1.3404 1.5147 1.2748 2.4113 3.8477 3.2736 2.4780 1.5934 1.3033 1.3765 1.7139 3.3985 1.6634 1.7019 1.9599 1.1801 1.5637 1.2333 2.0209 2.3879 1.6493 1.1664 2.0135 1.8474 1.2450 1.8035 2.2893 1.4054 1.3170 2.4193 2.4928 1.1651 2.2502 3.6564 1.5980 1.3949 1.2905 2.0495 1.8534 1.0710 1.1046 1.0494 1.7290 1.2249 1.0501 1.1140 1.3404 1.2999 1.3692 1.6247 1.3594 4.9969 3.4972 4.4985 7.0374 7.0432 6.2390 1.0368 1.0349 1.0352 1.0368 1.0607 1.0923 1.0654 1.1025 1.1049 1.1010 1.1005 1.1005 1.1003 1.0984 1.0906 1.0904 1.0870 1.0889 1.0946 1.1087 1.0928 1.0893 1.0944 1.0947 1.1003 1.0939
irintensity: 0.6281 1.1628 1.0223 0.1280 0.5887 0.6987 0.0987 0.6202 0.8516 0.1739 1.8767 1.8922 0.8058 0.5085 1.0205 2.2962 0.0374 7.8735 0.8002 0.4906 1.0775 0.3835 0.5299 1.1231 1.4244 7.4656 1.0850 6.5556 2.5447 0.3892 2.5853 9.9459 10.6455 10.3510 8.1927 8.3309 0.2073 1.9482 2.3999 0.4218 1.3677 10.2624 25.2144 96.7515 5.1094 4.4645 12.9244 69.5146 49.6391 3.7062 0.0038 11.9508 71.9272 0.2760 0.0528 2.8659 44.3581 38.7166 13.7485 20.1969 0.3194 1.7823 9.2318 0.1076 0.0737 6.9611 1.6201 17.2175 2.1075 14.9677 1.9524 18.9241 0.9051 2.7285 76.0977 1.2112 5.3484 8.7987 83.8749 1.9405 72.5025 260.8403 26.2983 111.9906 4.1890 15.0618 5.2642 3.3021 62.5290 166.5166 360.1209 63.7950 69.0083 35.6945 6.6120 15.1593 317.5404 19.8541 25.9902 2.3043 6.7597 52.9952 16.3389 7.1683 8.9144 1.0852 59.8434 60.8961 18.1936 53.1826 6.1023 30.1802 46.5923 22.9798 20.2037 9.4583 945.6606 1568.9711 29.4972 262.9803 114.6495 73.3258 13.8853 12.5021 22.5050 22.1579 7.1249 27.9601 8.2941 1.7590 5.1532 20.2799 10.8103 28.5584 11.5706 0.7027 2.7172 7.9361 3.7523 11.0101 7.6530 5.1560 1.0349 9.4214 14.2265 19.2606 10.2990
temp: 298.150 k
press: 1.00000 atm
elementType: 17 7 7 6 6 6 6 6 6 6 6 6 6 6 6 6 6 6 6 6 6 6 6 6 6 1 1 1 1 1 1 1 1 1 1 1 1 1 1 1 1 1 1 1 1 1 1 1 1 1 1
symmnumber: 1
zpe: 1119723.6 jmol-1
zpe.correction: 0.426480 hartree
zpe.thermalcorrener: 0.451549 hartree
zpe.thermalcorrenthalpy: 0.452493 hartree
zpe.thermalcorrgfe: 0.369617 hartree
zpe.sumelectzpe: -1421.479380 hartree
zpe.sumelectthermal: -1421.454312 hartree
zpe.sumelectthermalent: -1421.453367 hartree
zpe.sumelectthermalfe: -1421.536243 hartree
dipole: -2.6355 -1.8857 -0.2246
dipole: 3.2485
quadrupole: -40.2972 -123.7801 -157.4494
quadrupole: -29.9306 -1.3921 -4.0397
quadrupole: 66.8784 -16.6045 -50.2739 -29.9306 -1.3921 -4.0397
hfenergy: -1421.9058604 hartree
pointgroup: C01 [X(C22H26Cl1N2)]
dipole: 0.9714881 0.2312452 0.797573 debye
polarizability: 800.2436059|12.0066239|135.5471311|-20.9531585|4.110463|259.238004 unknown
InChI: InChI=1S/C22H26ClN2/c1-22(2)19-7-5-6-8-20(19)25(4)21(22)14-11-17-9-12-18(13-10-17)24(3)16-15-23/h5-14H,15-16H2,1-4H3
charge 1 multiplicity 1
51 atoms
Cl -7.713201 -1.0548 -3.142393
N  3.075697 0.065023 -1.358249
N  -5.8137 0.086739 0.359134
C  3.081999 0.095596 1.02223
C  4.503801 0.10675 0.455069
C  2.23398 0.069122 -0.270234
C  4.453071 0.088276 -0.958556
C  2.859203 -1.185528 1.885224
C  2.825669 1.391671 1.852523
C  5.744941 0.131466 1.108047
C  0.824638 0.05541 -0.423924
C  5.608874 0.093876 -1.760515
C  2.633278 0.042211 -2.762747
C  6.92634 0.137411 0.323053
C  6.856036 0.118842 -1.091648
C  -0.108845 0.05541 0.621427
C  -1.539307 0.051866 0.502296
C  -2.246182 0.048468 -0.749177
C  -2.338452 0.054222 1.695539
C  -4.431638 0.065152 0.39943
C  -3.635964 0.052316 -0.80598
C  -3.730778 0.058702 1.657225
C  -6.561214 0.158256 -0.918296
C  -6.605145 0.02521 1.60796
C  -6.813718 -1.245178 -1.503839
H  3.041585 -2.101035 1.2967
H  3.563463 -1.180824 2.735062
H  1.835334 -1.233706 2.292306
H  2.990116 2.296384 1.242423
H  1.798597 1.426068 2.252774
H  3.525235 1.424161 2.705708
H  5.811829 0.146229 2.201158
H  0.443785 0.046809 -1.451246
H  5.573242 0.080524 -2.853727
H  3.510579 0.029105 -3.42302
H  2.034781 0.939908 -2.996591
H  2.031721 -0.860742 -2.965711
H  7.904234 0.156839 0.813929
H  7.779108 0.124113 -1.679635
H  0.26989 0.060165 1.650443
H  -1.691734 0.038563 -1.693495
H  -1.835575 0.056951 2.670407
H  -4.118724 0.039668 -1.786453
H  -4.28715 0.069276 2.597031
H  -7.526907 0.658485 -0.734837
H  -6.018865 0.781641 -1.648507
H  -6.452449 0.930656 2.224774
H  -6.343079 -0.863939 2.209628
H  -7.67366 -0.039021 1.354514
H  -5.880853 -1.784381 -1.725154
H  -7.466186 -1.856988 -0.863684
