program: Gaussian 09
title: 000221285
version: EM64L-G09RevD.01
frameworkgroup: C1[X(C11H14O2)]
method: RPBEPBE
basis: SDD
operation: Freq
keyword: #pfreq=noraman
keyword: PBEPBE/SDD
title: #p freq=noraman PBEPBE/SDD
converged: YES YES NO NO
title: Mulliken charges:
elementType: O O C C C C C C C C C C C H H H H H H H H H H H H H H
charge: -0.444464 -0.335684 -0.262986 0.368154 -0.511694 0.225923 -0.408185 -0.355625 -0.246790 -0.011605 -0.238189 -0.601714 -0.532690 0.240599 0.228082 0.223945 0.241881 0.239011 0.229818 0.227473 0.227191 0.361970 0.228104 0.228477 0.244923 0.214207 0.219867
chargesum: 0.00000
title: Mulliken charges with hydrogens summed into heavy atoms:
elementType: O O C C C C C C C C C C C
charge: -0.082494 -0.335684 -0.022387 0.368154 -0.059667 0.225923 -0.166304 -0.116615 -0.016973 0.215868 -0.010998 -0.167640 0.168815
polarizability: 1.49854051e+02 1.28345696e+00 1.37957734e+02 1.21688307e+01 1.75232616e+00 8.24285528e+01
1716.lowfreq: -9.4862 -0.0005 -0.0003 0.0002 3.1172 11.9493 43.9318 54.6359 82.8110
frequency: 43.9101 54.6335 82.8000 98.1247 126.1972 167.4913 193.7132 219.1393 257.4097 274.0027 318.0402 339.2220 401.6017 435.7816 481.6070 490.3666 529.6860 548.4674 565.1549 611.4006 640.4375 709.9366 744.8581 755.3650 792.4286 852.2757 914.2444 934.7032 940.2123 948.4200 965.0529 976.3656 988.5156 1007.1199 1017.1526 1046.0306 1094.3724 1113.1959 1120.2299 1152.1304 1172.3199 1189.6663 1200.0743 1212.8797 1233.9998 1272.6007 1288.9677 1315.4896 1318.8386 1385.6081 1408.4397 1424.2392 1432.2913 1444.9028 1462.4274 1466.7167 1470.6951 1485.3320 1594.9313 1606.9351 1654.5927 2969.5329 2982.8445 3043.3185 3060.2185 3061.7115 3080.9672 3094.5574 3126.6478 3127.1978 3137.4527 3156.5829 3170.1307 3193.5412 3471.0477
redmass: 3.8794 3.7283 2.6082 3.3489 3.0808 3.1508 2.9066 1.6730 2.1849 3.2291 4.5061 3.2106 2.9275 3.4172 3.1239 2.8581 1.3863 3.2016 2.6836 4.3090 1.7671 4.0592 3.2379 1.3440 3.8895 1.4274 1.5169 1.4565 1.4996 1.8566 4.6838 1.3501 8.4542 1.1456 3.2385 2.1630 2.0277 1.2664 1.6202 1.5157 1.1486 1.9843 1.4541 2.6437 1.2405 1.3759 1.2306 1.3650 1.3316 5.2186 1.2902 1.2032 1.4047 1.6089 1.1211 1.0527 1.2956 1.7203 6.7107 6.6684 4.6465 1.0321 1.0609 1.0889 1.0961 1.1045 1.0664 1.0877 1.0959 1.0910 1.0894 1.0935 1.0997 1.1145 1.0652
irintensity: 1.1552 0.3514 0.3992 5.3706 0.3570 0.1744 1.3183 0.6138 1.0213 3.5157 3.4311 0.3084 0.1248 2.0296 4.8234 15.5486 122.5968 39.8303 19.2319 4.5597 30.9265 10.1042 1.2439 97.8839 2.4073 0.2026 34.0171 4.4301 60.2515 29.9671 75.2101 1.6633 50.8432 22.2056 6.5476 5.9109 18.6760 0.5968 23.2884 11.0424 15.1266 32.4560 5.2042 106.3642 32.7904 8.9498 2.2279 2.8919 9.2541 7.7966 31.1035 7.9832 33.9383 7.9539 16.5140 15.0326 77.5522 8.5731 13.1493 14.9511 18.1197 60.4743 15.9631 9.5441 24.4635 39.4494 27.2240 8.8631 13.5659 9.8342 9.5267 25.2003 16.8759 27.0933 46.7639
temp: 298.150 k
press: 1.00000 atm
elementType: 8 8 6 6 6 6 6 6 6 6 6 6 6 1 1 1 1 1 1 1 1 1 1 1 1 1 1
symmnumber: 1
zpe: 584193.3 jmol-1
zpe.correction: 0.222507 hartree
zpe.thermalcorrener: 0.235682 hartree
zpe.thermalcorrenthalpy: 0.236627 hartree
zpe.thermalcorrgfe: 0.182510 hartree
zpe.sumelectzpe: -576.993961 hartree
zpe.sumelectthermal: -576.980786 hartree
zpe.sumelectthermalent: -576.979842 hartree
zpe.sumelectthermalfe: -577.033959 hartree
dipole: -2.9077 -0.0509 -2.6419
dipole: 3.9290
quadrupole: -69.7141 -69.4296 -85.6027
quadrupole: 6.1761 3.9217 5.6586
quadrupole: 5.2014 5.4858 -10.6872 6.1761 3.9217 5.6586
hfenergy: -577.2164683 hartree
pointgroup: C01 [X(C11H14O2)]
dipole: 1.1361886 -0.7431244 0.7390933 debye
polarizability: 148.5425591|-6.8944697|137.7623375|2.58053|13.9953304|83.9354416 unknown
InChI: InChI=1S/C11H14O2/c1-3-6-10(12)9-7-4-5-8-11(9)13-2/h3-5,7-8,10,12H,1,6H2,2H3
charge 0 multiplicity 1
27 atoms
O  -1.545023 -0.603556 -1.95459
O  0.305488 -1.973423 -0.441326
C  -1.350072 0.291015 -0.801033
C  0.122983 0.421701 -0.418535
C  -2.249372 -0.167473 0.392339
C  0.946033 -0.726633 -0.226516
C  0.715278 1.690393 -0.234803
C  2.304482 -0.6075 0.141281
C  2.073292 1.831034 0.137832
C  -2.279381 0.816402 1.541942
C  2.864177 0.678731 0.325829
C  -3.384471 1.482718 1.963849
C  1.09779 -3.196032 -0.279373
H  -1.713464 1.270927 -1.155785
H  -3.267028 -0.319406 -0.011946
H  -1.875522 -1.151367 0.740436
H  0.097088 2.582869 -0.388606
H  2.930788 -1.493061 0.283329
H  2.505905 2.827461 0.274256
H  -1.322034 0.992833 2.056312
H  3.91792 0.771149 0.610922
H  -1.099577 -1.463321 -1.721135
H  1.47678 -3.288268 0.755797
H  1.943092 -3.221424 -0.992984
H  0.403308 -4.021355 -0.494924
H  -3.346278 2.18713 2.802728
H  -4.360081 1.339057 1.482602
