program: Gaussian 09
title: 000221282
version: EM64L-G09RevD.01
frameworkgroup: C1[X(C9H9IO)]
method: RPBEPBE
basis: SDD
operation: Freq
keyword: #pfreq=noraman
keyword: PBEPBE/SDD
title: #p freq=noraman PBEPBE/SDD
converged: YES YES NO NO
title: Mulliken charges:
elementType: I O C C C C C C C C C H H H H H H H H H
charge: 0.058902 -0.202853 -0.637507 0.314209 0.205697 -0.331102 -0.340207 -0.636920 -0.244867 -0.226048 -0.221354 0.299948 0.242317 0.278420 0.270217 0.235937 0.230475 0.233561 0.235624 0.235551
chargesum: 0.00000
title: Mulliken charges with hydrogens summed into heavy atoms:
elementType: I O C C C C C C C C C
charge: 0.058902 -0.202853 -0.337560 0.314209 0.205697 -0.088785 -0.061787 0.099710 -0.011306 0.009576 0.014197
polarizability: 1.57535147e+02 5.57548113e+00 1.24228599e+02 3.25802695e+00 -6.94639431e+00 8.20667350e+01
1716.lowfreq: -17.9311 -5.7947 -0.0001 0.0005 0.0008 6.2626 29.6315 49.7971 107.8238
frequency: 28.6973 49.7760 107.8052 145.3599 169.5968 227.4496 246.1741 305.7733 339.0824 398.9108 405.2079 462.1743 492.5033 612.6742 635.8720 687.9307 697.6929 738.5604 798.5261 854.1010 943.0824 945.1001 981.8802 989.2306 991.7021 1011.7836 1027.1281 1052.5383 1080.4642 1089.7392 1145.6331 1174.7607 1193.3938 1231.2805 1310.8211 1331.1254 1387.9296 1393.1725 1435.9463 1456.7330 1461.7781 1479.1645 1560.8943 1594.5231 1609.3972 2985.8964 3076.5313 3085.6041 3127.8519 3131.0887 3140.6533 3151.2632 3160.9206 3171.2848
redmass: 5.7168 4.5315 9.3560 4.5540 4.7552 1.7768 1.3728 4.5303 5.3327 2.8088 4.6411 4.3503 4.5903 6.4118 5.0527 3.7314 1.5752 3.9531 2.2717 1.2540 1.8230 2.5353 1.4882 3.0032 1.7348 1.3451 2.1366 1.3936 2.0618 1.5717 1.6347 1.0614 1.1369 2.4786 1.5490 1.5202 9.0782 1.2029 2.2698 1.0454 1.0518 2.1897 7.8056 6.6446 6.1720 1.0412 1.0867 1.0918 1.1010 1.0852 1.0880 1.0924 1.0962 1.1014
irintensity: 1.3360 0.5060 1.6531 0.3922 2.0025 1.4717 0.3785 10.8537 5.6814 0.0935 2.2907 10.8672 11.4805 0.1210 12.4812 3.9763 72.7823 4.6163 27.2133 1.0393 19.1411 34.1427 28.3715 1.4089 1.9321 0.6631 1.3158 7.5629 27.5087 13.8038 31.5360 1.7626 12.3257 146.5696 24.5840 52.0620 2.9570 31.4307 20.3361 13.8100 17.7500 2.2623 123.7500 31.7497 14.1734 13.7860 2.6929 17.6801 8.1507 0.3426 5.1336 16.8047 18.7492 20.2001
temp: 298.150 k
press: 1.00000 atm
elementType: 53 8 6 6 6 6 6 6 6 6 6 1 1 1 1 1 1 1 1 1
symmnumber: 1
zpe: 402628.1 jmol-1
zpe.correction: 0.153353 hartree
zpe.thermalcorrener: 0.164044 hartree
zpe.thermalcorrenthalpy: 0.164988 hartree
zpe.thermalcorrgfe: 0.114265 hartree
zpe.sumelectzpe: -434.290182 hartree
zpe.sumelectthermal: -434.279491 hartree
zpe.sumelectthermalent: -434.278547 hartree
zpe.sumelectthermalfe: -434.329269 hartree
dipole: -2.0553 -1.4008 2.3540
dipole: 3.4246
quadrupole: -69.1715 -81.3942 -78.1865
quadrupole: 4.3169 2.7909 1.4754
quadrupole: 7.0792 -5.1435 -1.9357 4.3169 2.7909 1.4754
hfenergy: -434.4435348 hartree
pointgroup: C01 [X(C9H9I1O1)]
dipole: -0.9942219 0.8813579 -0.2237301 debye
dipolederiv: -0.1941569 -0.0601491 -0.0943881 -0.0779837 -0.1088182 -0.0462555 -0.0814619 -0.0521312 -0.468565 -0.8499501 0.0506047 0.079497 0.2072244 -0.6595066 -0.3480734 0.2067198 -0.1486895 -0.4019659 -0.1142733 -0.1029526 -0.1003057 -0.1513306 -0.0762047 -0.1472001 -0.0257041 -0.1115026 0.7492569 -0.8347545 0.0019192 0.0480914 -0.0851647 -0.0787635 -0.0496949 0.1702947 -0.0252412 0.0036884 1.7740987 0.0851825 0.1013401 0.138052 0.6830704 0.5648774 -0.2246817 0.2520638 0.1744813 0.1463739 0.1028967 0.0095047 -0.1144898 -0.0208773 0.0424644 -0.0525938 0.0450696 -0.0884668 0.0923001 -0.1253511 -0.0591214 0.1580225 0.0133847 0.0516602 0.0194741 0.0576313 -0.0674759 -0.0753719 0.0076973 -0.0191015 -0.0459871 0.02821 0.0122143 0.0998219 0.0078382 -0.2242233 -0.2229252 -0.1266718 -0.0544925 -0.1824032 0.0409235 0.092319 -0.0824812 0.1018368 -0.1065146 -0.1097692 0.1884288 0.0433755 0.2114028 0.0121315 0.0559525 0.0737675 0.0374176 -0.1399085 0.1435559 -0.0050703 -0.0516965 0.0022421 0.016594 0.0481307 -0.0390615 0.0589892 -0.1000592 -0.0026146 0.0954826 -0.0238192 0.0500013 -0.0186511 -0.0077582 -0.046177 0.0347689 -0.0546663 0.0463532 -0.0992677 -0.0063215 -0.1112428 0.0039484 -0.0486196 -0.0299363 -0.0434972 0.1113064 0.1240524 0.063826 0.0431132 0.0169439 0.0352964 -0.0451346 0.0137503 -0.0567967 0.1256738 0.1028988 0.0392383 0.0095326 0.1171292 -0.0128234 0.019612 -0.0136213 0.0362677 0.1161422 -0.0130123 -0.0904844 0.0137858 -0.1303253 -0.0186868 -0.0254227 -0.0359182 -0.0526384 0.1074507 0.0653003 0.0091936 0.0099503 0.0215667 0.11562 -0.0026922 -0.02824 0.0298206 -0.1290732 0.0431063 0.0507578 0.030837 0.0758268 -0.0392579 -0.0858436 0.0485745 -0.0910349 0.1159543 -0.0066799 -0.0945154 -0.0190866 -0.108733 -0.0188494 -0.0569464 -0.01909 -0.0578204 0.1359844 -0.1145318 0.009235 0.0393053 0.0092484 0.10326 -0.0235893 0.0465642 -0.0223515 0.14098 unknown
polarizability: 156.933933|6.8659359|99.3704859|3.1566225|22.204787|107.5260627 unknown
InChI: InChI=1S/C9H9IO/c1-7(10)9(11)8-5-3-2-4-6-8/h2-7H,1H3
charge 0 multiplicity 1
20 atoms
I  2.490611 0.933523 2.042178
O  1.451872 -1.291083 -0.890834
C  1.977546 0.955882 -0.160748
C  -0.45363 -0.04806 -0.0895
C  1.007116 -0.213599 -0.396473
C  -1.006865 1.136191 0.47069
C  -1.317186 -1.137843 -0.39196
C  3.260908 0.861329 -0.982806
C  -2.392779 1.226822 0.718283
C  -2.700161 -1.045691 -0.145048
C  -3.242717 0.13886 0.410042
H  1.485182 1.93501 -0.267918
H  -0.365617 1.981781 0.73952
H  -0.873876 -2.043075 -0.81981
H  3.758172 -0.108831 -0.827907
H  3.957068 1.677385 -0.729663
H  3.005722 0.935051 -2.05849
H  -2.809379 2.140518 1.155469
H  -3.355942 -1.890452 -0.381621
H  -4.318642 0.21218 0.604095
