program: Gaussian 09
title: 000221279
version: EM64L-G09RevD.01
frameworkgroup: C1[X(C8H13BrO2)]
method: RPBEPBE
basis: SDD
operation: Freq
keyword: #p
keyword: freq=noraman
keyword: PBEPBE/SDD
title: #p freq=noraman PBEPBE/SDD
converged: YES YES NO NO
title: Mulliken charges:
elementType: Br O O C C C C C C C C H H H H H H H H H H H H H
charge: 0.011864 -0.261333 -0.227886 0.040446 -0.425576 -0.445310 -0.400448 -0.396804 -0.388175 0.350848 -0.779180 0.235812 0.208313 0.235661 0.213361 0.210755 0.209551 0.200644 0.198210 0.208504 0.205363 0.192822 0.300444 0.302113
chargesum: 0.00000
title: Mulliken charges with hydrogens summed into heavy atoms:
elementType: Br O O C C C C C C C C
charge: 0.011864 -0.261333 -0.227886 0.276258 0.018397 -0.021194 0.009747 0.009911 0.010010 0.350848 -0.176623
polarizability: 1.26964820e+02 5.98190938e+00 9.75669058e+01 -5.93571912e-01 1.56938500e+00 8.64345047e+01
1716.lowfreq: -2.2153 -0.0008 -0.0004 -0.0004 9.7142 17.2878 28.4365 43.1085 64.0753
frequency: 26.7580 42.4514 63.7358 90.8426 143.1257 202.3861 222.2823 282.8427 326.5538 335.8887 428.6067 439.1132 451.0530 501.1913 536.5966 639.7926 725.1689 787.1781 791.3037 823.0583 857.6481 882.6539 894.1911 904.1421 924.2724 944.3406 997.7925 1044.4711 1055.1512 1081.1203 1087.8826 1109.7730 1152.5285 1200.1587 1219.6748 1232.2819 1240.9208 1255.3700 1261.2422 1302.1543 1310.9283 1333.0244 1338.7656 1341.5039 1351.4936 1363.1525 1425.1389 1464.1896 1466.5814 1467.7339 1474.4761 1483.4103 1626.9345 2972.5406 2974.1053 2975.9969 2990.5554 2992.4990 3010.3151 3036.8533 3038.7574 3046.8786 3057.4009 3066.1879 3083.3097 3181.0342
redmass: 5.4765 4.6846 6.5382 3.3395 6.8328 3.4854 1.8430 3.5803 2.0037 4.0672 3.2926 3.2040 2.1855 3.0593 2.7328 4.8616 7.2698 1.7371 1.7897 3.5222 2.0016 1.9103 1.7257 1.7132 1.7664 4.5894 2.7301 1.8549 1.0984 1.3578 1.2973 2.6868 2.2961 1.5120 1.6086 1.6471 1.3110 1.2801 1.3108 1.2105 1.3241 1.3551 1.4882 1.4602 1.5364 1.4732 1.1184 1.0861 1.0909 1.0907 1.0833 1.0975 10.6646 1.0660 1.0615 1.0627 1.0610 1.0643 1.0825 1.0957 1.0980 1.1012 1.1029 1.1030 1.0556 1.1125
irintensity: 0.6684 0.7604 0.6494 1.6547 1.4487 6.3371 0.3375 1.5652 2.3454 3.6167 3.9576 2.2702 0.6697 8.7377 14.5138 13.3480 0.0937 2.6059 3.1414 3.6690 4.2044 2.7012 10.0158 8.9757 3.6894 91.6978 70.9323 0.2262 0.3117 73.8931 61.3707 0.4429 1.5406 1.6475 160.0169 123.1884 1.6030 2.7833 1.8913 4.8375 0.4119 0.3717 1.6155 0.3003 0.6590 5.2451 19.7766 1.2932 14.6610 6.8347 20.6632 3.7021 193.5453 29.3181 35.4113 33.1649 13.3618 13.5784 18.7242 56.4335 61.8964 35.0218 22.8648 66.0690 7.2033 0.6674
temp: 298.150 k
press: 1.00000 atm
elementType: 35 8 8 6 6 6 6 6 6 6 6 1 1 1 1 1 1 1 1 1 1 1 1 1
symmnumber: 1
zpe: 522657.2 jmol-1
zpe.correction: 0.199070 hartree
zpe.thermalcorrener: 0.210573 hartree
zpe.thermalcorrenthalpy: 0.211517 hartree
zpe.thermalcorrgfe: 0.158813 hartree
zpe.sumelectzpe: -475.691563 hartree
zpe.sumelectthermal: -475.680059 hartree
zpe.sumelectthermalent: -475.679115 hartree
zpe.sumelectthermalfe: -475.731820 hartree
dipole: 2.4385 0.8025 -1.5284
dipole: 2.9877
quadrupole: -71.0871 -72.0213 -81.6756
quadrupole: -3.7260 1.0771 -2.5964
quadrupole: 3.8409 2.9067 -6.7476 -3.7260 1.0771 -2.5964
hfenergy: -475.8906323 hartree
pointgroup: C01 [X(C8H13Br1O2)]
dipole: -0.9981575 -0.6089712 -0.1205148 debye
dipolederiv: -0.2391573 -0.0166872 0.0939746 -0.0924137 -0.177864 0.1057015 0.1633703 0.0652374 -0.2388119 -1.7781535 -0.0489422 -0.1699638 -0.0465414 -0.3757228 -0.1274247 -0.2866041 -0.1040635 -0.4641402 -0.7021434 0.011945 0.0744417 -0.1198836 -0.3553158 -0.2894076 -0.3400562 -0.1565061 -0.7913104 0.9912084 -0.0323258 0.0206891 -0.1323618 0.3359888 -0.0359508 -0.1328858 -0.0754433 0.2287687 -0.1581534 -0.0011232 0.0193196 0.0174671 -0.0457427 0.0040578 0.0695643 0.0164575 0.1133066 -0.1086539 0.0100923 0.0056523 0.0182067 0.0353928 -0.0317472 0.0383766 0.0010888 0.1312153 0.1133981 -0.0315517 -0.0062605 0.0470526 0.0726099 -0.0133293 -0.0624745 0.0230741 0.1549776 0.1006245 0.0125271 0.0046562 -0.0454084 0.0481761 0.0104013 -0.0649672 -0.013479 0.1556189 0.0491317 -0.0017579 -0.0182761 -0.0024315 0.0392932 0.000221 0.0307939 -0.0086627 0.1430893 1.7704761 0.112778 -0.0117473 0.2317883 0.221336 0.5126202 0.6123408 0.3260304 0.9970059 -0.0557371 0.0952262 0.0003087 0.1607062 0.3007547 -0.2375235 -0.0580726 -0.2169139 0.2032035 -0.0100123 0.0021096 -0.0193394 0.0312631 0.027679 0.0031666 0.050907 0.0252116 -0.0958041 0.0742724 0.0227511 0.0083968 0.0234515 0.0491425 -0.0254072 0.0303494 0.0244371 -0.1402394 -0.0546277 -0.1040465 -0.0385145 -0.0986432 -0.0172215 -0.01784 -0.0556438 -0.0441931 0.0550653 0.04606 0.0662069 -0.0160013 0.045896 -0.1626568 0.0475836 -0.0299525 0.0703091 0.0593187 0.0481388 -0.0080887 0.0210609 -0.0206144 0.0811847 0.0372123 0.0107283 -0.0288567 -0.1460798 -0.0038393 0.0410307 -0.0070432 0.0632643 -0.1869305 0.0454479 -0.0118283 0.0797486 0.0659308 0.019844 -0.0131611 -0.0045865 -0.0238325 0.0834916 0.0265335 0.0212429 -0.0439773 -0.1829297 0.0578591 0.0330929 -0.009619 0.0396862 0.0482585 -0.0015756 0.0517561 0.0463351 -0.1872894 -0.1132539 -0.1171584 -0.0444659 -0.1165483 -0.0694632 -0.0444505 -0.0721451 -0.0692193 0.0551201 -0.2059495 0.0710314 0.053978 0.0736094 0.0195528 -0.0168144 0.0849417 -0.0267526 0.0610407 0.0866807 -0.0204988 0.0209571 -0.0207712 0.0224344 0.001312 -0.0511413 0.0212468 -0.1901604 0.0835082 -0.0782833 0.0143034 -0.0291013 -0.0521569 -0.0183162 0.0445054 0.0096632 0.0351457 -0.0115208 -0.0051663 0.0080791 -0.0038401 0.0577794 0.0655293 -0.0431054 0.0792281 -0.0220419 unknown
polarizability: 124.0980509|4.4865409|92.9217656|-9.7966056|-6.8765107|93.9464143 unknown
InChI: InChI=1S/C8H13BrO2/c9-6-8(10)11-7-4-2-1-3-5-7/h7H,1-6H2
charge 0 multiplicity 1
24 atoms
Br 3.711951 0.529087 -1.748507
O  0.720596 -0.707137 -0.401424
O  1.860661 0.237446 1.412639
C  -0.604789 -0.248445 0.153451
C  -0.875136 1.200246 -0.290906
C  -1.653988 -1.232021 -0.378437
C  -2.291192 1.635087 0.165502
C  -3.070043 -0.795753 0.075652
C  -3.375169 0.660177 -0.354173
C  1.858249 -0.368738 0.31591
C  3.099781 -0.86078 -0.404034
H  -0.533681 -0.295016 1.258012
H  -0.803537 1.252576 -1.395117
H  -0.106741 1.873804 0.129841
H  -1.425621 -2.254263 -0.024246
H  -1.602429 -1.245258 -1.484699
H  -2.492089 2.663327 -0.189478
H  -2.326769 1.6679 1.2739
H  -3.145789 -0.875143 1.179801
H  -3.822685 -1.488688 -0.345331
H  -4.372007 0.966086 0.016856
H  -3.412742 0.713272 -1.461748
H  2.906809 -1.769489 -0.98935
H  3.934961 -0.974574 0.298685
