program: Gaussian 09
title: 000221252
version: EM64L-G09RevD.01
frameworkgroup: C1[X(C10H16Cl2O)]
method: RPBEPBE
basis: SDD
operation: Freq
keyword: #p
keyword: freq=noraman
keyword: PBEPBE/SDD
title: #p freq=noraman PBEPBE/SDD
converged: YES YES NO NO
title: Mulliken charges:
elementType: Cl Cl O C C C C C C C C C C H H H H H H H H H H H H H H H H
charge: -0.092397 -0.092396 -0.274051 -0.236478 -0.236478 -0.477532 -0.477534 -0.136670 -0.136666 -0.114809 -0.114809 -0.655593 -0.655595 0.189914 0.204145 0.189913 0.204144 0.224411 0.227122 0.224412 0.227122 0.226960 0.226959 0.247988 0.247987 0.259251 0.270714 0.259252 0.270714
chargesum: 0.00000
title: Mulliken charges with hydrogens summed into heavy atoms:
elementType: Cl Cl O C C C C C C C C C C
charge: -0.092397 -0.092396 -0.274051 0.157581 0.157579 -0.025998 -0.025999 0.090290 0.090293 0.133178 0.133178 -0.125628 -0.125629
polarizability: 2.02730838e+02 -6.61085877e-04 1.12868483e+02 -1.90969178e+01 2.56912350e-04 1.06649719e+02
1716.lowfreq: -8.4500 -2.0643 -0.0013 -0.0012 0.0014 1.9270 15.2352 21.3452 25.5841
frequency: 15.1614 21.2255 25.5822 46.5247 63.4475 94.9153 99.2190 119.3939 123.1358 127.9803 153.9106 208.0469 221.5678 245.4938 307.9221 340.6886 346.1577 408.2390 451.9203 513.6105 548.8243 597.9886 601.7410 793.1198 800.5019 835.0190 842.7193 882.2752 886.5570 924.8887 973.1008 974.0987 1003.5670 1005.9347 1029.0937 1060.5758 1074.0651 1088.5910 1090.6977 1110.6967 1111.0744 1148.1111 1161.7286 1190.9343 1196.4674 1237.3775 1237.9942 1260.9775 1261.1697 1267.7831 1272.5488 1299.0013 1299.2872 1319.1328 1327.4137 1351.1554 1399.8710 1455.0403 1455.0557 1461.0003 1464.7843 1479.1422 1493.3730 1676.3423 1676.5566 2914.5319 2923.8560 2971.4862 2973.1027 2987.6997 2988.1510 3057.2517 3057.3823 3058.6761 3058.6777 3078.6815 3078.7578 3115.6599 3115.6644 3145.2909 3145.2939
redmass: 9.4301 4.2366 6.2677 3.5840 3.9420 2.7614 3.3255 3.5492 2.1129 3.8459 2.8809 2.3475 2.9881 4.0543 3.4793 3.4629 4.0654 3.5207 3.1724 2.6984 2.8638 5.1914 5.4164 1.1879 1.2191 1.7675 1.6975 1.7843 1.6292 3.4823 1.1891 1.2387 1.4867 1.4444 5.5401 6.7340 3.8813 1.3077 1.2536 2.7215 3.0411 1.3414 1.5674 1.4159 1.3301 1.1607 1.1592 1.2033 1.1384 1.1686 1.2763 1.2672 1.2714 1.2384 1.3559 1.3809 1.4286 1.1274 1.1278 1.0848 1.0889 1.0879 1.0796 6.2839 6.2872 1.0559 1.0562 1.1019 1.1021 1.0638 1.0645 1.0828 1.0803 1.0724 1.0714 1.0938 1.0939 1.0922 1.0922 1.1098 1.1098
irintensity: 1.0299 1.2964 0.7228 2.0466 1.1652 6.5633 0.1679 0.1180 0.5878 4.2945 1.0935 7.9803 0.5834 0.0087 0.9732 7.8001 24.1229 23.3498 0.8090 2.7103 9.6921 64.3896 67.3142 0.3727 7.7661 1.3677 3.0458 0.0042 2.0854 9.3469 34.6347 69.7610 10.9181 36.8047 19.4479 233.5253 0.6501 2.5567 1.8181 0.7727 13.6381 1.0727 13.7724 2.0304 9.4495 22.3286 11.2075 8.0220 0.2530 2.1088 0.7992 2.8064 0.1945 21.1020 0.2621 37.8360 0.1188 17.7851 0.0223 2.4973 16.1273 7.8766 5.2074 44.6711 4.7392 24.9927 83.4518 74.1789 0.0074 15.0048 40.8173 0.6819 36.8464 17.6929 8.5263 13.4517 58.0728 10.1388 10.5624 16.2748 16.5490
temp: 298.150 k
press: 1.00000 atm
elementType: 17 17 8 6 6 6 6 6 6 6 6 6 6 1 1 1 1 1 1 1 1 1 1 1 1 1 1 1 1
symmnumber: 1
zpe: 623443.9 jmol-1
zpe.correction: 0.237457 hartree
zpe.thermalcorrener: 0.253881 hartree
zpe.thermalcorrenthalpy: 0.254825 hartree
zpe.thermalcorrgfe: 0.188084 hartree
zpe.sumelectzpe: -1384.916913 hartree
zpe.sumelectthermal: -1384.900490 hartree
zpe.sumelectthermalent: -1384.899546 hartree
zpe.sumelectthermalfe: -1384.966286 hartree
dipole: 0.0001 2.4037 0.0000
dipole: 2.4037
quadrupole: -113.1680 -100.1325 -89.4492
quadrupole: 0.0007 17.8984 0.0003
quadrupole: -12.2514 0.7841 11.4674 0.0007 17.8984 0.0003
hfenergy: -1385.1543705 hartree
pointgroup: C01 [X(C10H16Cl2O1)]
dipole: -0.0000615 -0.9456937 -0.0004232 debye
polarizability: 187.9818888|-0.0196141|112.8684858|39.5506757|-0.0050766|121.3986659 unknown
InChI: InChI=1S/C10H16Cl2O/c11-7-3-1-5-9-13-10-6-2-4-8-12/h1-4H,5-10H2
charge 0 multiplicity 1
29 atoms
Cl 6.108951 2.27597 2.211351
Cl -6.108692 2.278272 -2.209606
O  0.000034 -0.340732 -0.000303
C  1.220098 0.473182 0.036838
C  -1.220014 0.473247 -0.036564
C  2.408502 -0.504125 0.096721
C  -2.408435 -0.503973 -0.097543
C  3.736175 0.215871 0.039064
C  -3.736097 0.215989 -0.039221
C  4.693129 0.158209 1.00499
C  -4.693014 0.159292 -1.005241
C  6.004761 0.860365 0.906395
C  -6.00463 0.861392 -0.906025
H  1.281095 1.112839 -0.87291
H  1.214979 1.139445 0.927194
H  -1.281013 1.111901 0.873888
H  -1.214871 1.140487 -0.926188
H  2.309073 -1.197567 -0.762389
H  2.330294 -1.110988 1.016452
H  -2.30907 -1.198323 0.760841
H  -2.330174 -1.109867 -1.017908
H  3.924813 0.827351 -0.858565
H  -3.924759 0.826589 0.859001
H  4.516978 -0.431653 1.914705
H  -4.516833 -0.429682 -1.915526
H  6.159524 1.358775 -0.061686
H  6.864716 0.22573 1.16623
H  -6.159429 1.358862 0.062534
H  -6.864593 0.227042 -1.166529
