program: Gaussian 09
title: 000221245
version: EM64L-G09RevD.01
frameworkgroup: C1[X(C16H21NO3)]
method: RPBEPBE
basis: SDD
operation: Freq
keyword: #p
keyword: freq=noraman
keyword: PBEPBE/SDD
title: #p freq=noraman PBEPBE/SDD
converged: NO YES NO NO
title: Mulliken charges:
elementType: O O O N C C C C C C C C C C C C C C C C H H H H H H H H H H H H H H H H H H H H H
charge: -0.459504 -0.269137 -0.310252 -0.074101 -0.230457 -0.118510 -0.062569 -0.501889 -0.485040 -0.497397 -0.119547 -0.388417 -0.643664 0.233000 0.214678 -0.337381 -0.336865 -0.219092 -0.217734 -0.221153 0.243800 0.232144 0.247424 0.225527 0.233650 0.233168 0.222240 0.211865 0.221931 0.227504 0.252420 0.237842 0.225178 0.230266 0.199148 0.362855 0.271030 0.268700 0.234142 0.231434 0.232763
chargesum: 0.00000
title: Mulliken charges with hydrogens summed into heavy atoms:
elementType: O O O N C C C C C C C C C C C C C C C C
charge: -0.096649 -0.269137 -0.310252 -0.074101 0.013343 0.113634 0.184855 -0.042712 -0.029633 -0.063600 0.107957 0.101844 0.010929 0.233000 0.214678 -0.066351 -0.068165 0.015050 0.013700 0.011610
polarizability: 2.62590958e+02 2.48686812e+00 1.69131334e+02 9.40147069e+00 -1.40303946e+01 1.29930249e+02
1716.lowfreq: -27.0974 -0.0008 -0.0004 -0.0002 3.0586 11.0722 22.7367 33.3234 43.4374
frequency: 17.2712 32.6823 42.5763 96.0527 102.2921 121.8380 150.7691 184.1261 198.6635 207.3698 219.4586 229.4515 254.2491 292.7864 328.0293 335.4724 368.1356 387.7277 398.2734 403.4125 404.0245 445.4285 476.4430 531.3585 568.0413 613.7404 619.0475 635.2083 669.4666 689.7224 690.9193 702.3678 744.4052 755.5938 768.5723 789.4590 795.5049 824.2865 859.5299 864.0891 885.8709 890.5602 933.6534 948.3061 954.6897 966.5409 990.6537 995.8513 997.2257 1007.7139 1008.5724 1013.0231 1022.3792 1042.8971 1046.5961 1066.5031 1081.4043 1089.6395 1104.1527 1120.8522 1126.5138 1148.7425 1157.3959 1173.9996 1181.6746 1191.2852 1207.5254 1216.0871 1227.5630 1245.7476 1248.0155 1254.0540 1266.2666 1282.6043 1288.0556 1302.9263 1314.6898 1315.2184 1326.6876 1342.2991 1352.5088 1367.6398 1390.7686 1398.8233 1426.1990 1438.1178 1451.5316 1462.3673 1465.2532 1468.9107 1477.7676 1482.7867 1487.3407 1573.6124 1602.1251 1612.4086 2891.7707 2992.9942 3002.3380 3002.8627 3013.2753 3025.2998 3027.5499 3034.3205 3044.2042 3044.7247 3056.1632 3060.6210 3079.3521 3079.9105 3115.4463 3130.7143 3143.9307 3156.6126 3168.8812 3179.1602 3355.9753
redmass: 4.4983 5.1750 4.0214 4.7347 6.0287 4.7963 4.6334 2.8517 3.9198 1.2183 2.5316 4.3633 2.9866 2.6763 4.3247 3.0171 3.0024 4.9090 3.8038 2.8548 3.2121 3.7601 5.9411 3.2103 2.6464 6.1035 2.8869 1.6154 3.7530 3.3234 3.2774 1.5787 4.0969 3.6971 4.5094 1.7520 2.1818 2.3410 3.5111 1.2470 3.3007 2.7263 2.2503 2.6802 1.4234 2.2481 6.2465 1.3938 2.0863 1.9996 1.3388 2.5246 2.3955 2.0720 2.6995 2.3620 1.8773 1.9742 1.7500 1.6451 1.8397 1.4571 1.9676 1.0569 1.1214 1.4324 1.4622 1.2546 1.2348 1.5004 1.4528 3.2013 1.4054 1.4103 1.3580 1.4768 1.3489 1.4278 1.4182 1.4814 1.3961 1.3926 10.1185 1.1518 1.1682 2.2481 1.1020 1.0732 1.0635 1.0831 2.2715 1.0520 1.0882 7.7446 7.5028 6.1779 1.0520 1.0613 1.0634 1.0797 1.0662 1.0774 1.0833 1.0862 1.0626 1.0836 1.1032 1.1004 1.1007 1.1046 1.1077 1.0856 1.0893 1.0940 1.0975 1.0979 1.0688
irintensity: 1.2252 1.8097 0.3009 0.6333 3.0285 0.8242 0.6665 4.3110 2.1200 1.3889 3.8174 1.3079 2.0891 1.6567 8.0523 9.2602 7.1980 2.5579 1.9702 0.4596 4.0562 4.6533 5.7941 2.1310 4.8816 1.3295 25.5617 214.3934 27.0794 21.7102 38.4615 94.6454 3.7131 2.7747 4.3236 13.0809 24.7032 3.4622 30.0235 0.2104 33.6686 15.0291 2.3335 6.4733 3.7295 4.3782 0.7653 0.3102 17.0171 9.7278 0.2487 2.7439 50.6909 48.9205 30.2996 181.7098 14.7943 64.8072 2.9534 4.6752 40.8203 3.0366 0.6075 0.1393 41.8452 2.7147 13.3063 7.8986 12.8828 5.3278 10.3918 313.8701 73.4160 4.0378 3.0557 0.7585 3.8521 1.1995 7.0787 4.9165 12.3555 31.6947 3.5569 25.5490 3.2608 16.0963 6.2357 2.8044 13.8856 28.1247 6.0808 2.2446 28.5775 121.5812 58.8483 36.0793 115.5081 22.3360 16.9360 4.9304 47.1303 47.5436 59.8080 28.1289 12.4847 39.6700 4.3426 57.5692 32.3022 61.8005 6.7746 0.2437 12.2777 17.9690 18.8904 9.9923 274.5220
temp: 298.150 k
press: 1.00000 atm
elementType: 8 8 8 7 6 6 6 6 6 6 6 6 6 6 6 6 6 6 6 6 1 1 1 1 1 1 1 1 1 1 1 1 1 1 1 1 1 1 1 1 1
symmnumber: 1
zpe: 902382.4 jmol-1
zpe.correction: 0.343699 hartree
zpe.thermalcorrener: 0.361533 hartree
zpe.thermalcorrenthalpy: 0.362477 hartree
zpe.thermalcorrgfe: 0.297007 hartree
zpe.sumelectzpe: -901.205301 hartree
zpe.sumelectthermal: -901.187468 hartree
zpe.sumelectthermalent: -901.186523 hartree
zpe.sumelectthermalfe: -901.251993 hartree
dipole: -0.9578 -3.3508 -0.0754
dipole: 3.4859
quadrupole: -89.1771 -119.2704 -123.0003
quadrupole: 0.2850 2.3640 -4.4310
quadrupole: 21.3055 -8.7878 -12.5177 0.2850 2.3640 -4.4310
hfenergy: -901.5490007 hartree
pointgroup: C01 [X(C16H21N1O3)]
dipole: -0.1290036 -1.3317017 -0.3012991 debye
polarizability: 256.3727592|15.4483089|175.6404452|24.0234802|-2.198448|129.6393374 unknown
InChI: InChI=1S/C16H21NO3/c1-17-12-7-8-14(17)13(15(18)9-12)10-20-16(19)11-5-3-2-4-6-11/h2-6,12-15,18H,7-10H2,1H3
charge 0 multiplicity 1
41 atoms
O  -0.939125 1.619787 1.194309
O  1.084327 -0.630208 -0.249979
O  1.190293 1.671834 -0.596256
N  -3.13228 -1.061116 -1.27323
C  -2.523793 -1.682765 -0.049542
C  -3.93617 0.053851 -0.665202
C  -1.352579 -0.754021 0.395723
C  -3.687506 -1.751229 1.004787
C  -4.656914 -0.599228 0.572772
C  -2.943291 1.161084 -0.229207
C  -1.944614 0.625745 0.827372
C  -0.326577 -0.671444 -0.759863
C  -3.937566 -2.003139 -2.086205
C  1.747808 0.586948 -0.258572
C  3.169977 0.47274 0.165743
C  3.953272 1.656057 0.20061
C  3.746262 -0.771018 0.534501
C  5.304082 1.594969 0.598273
C  5.097912 -0.826108 0.933386
C  5.878631 0.354372 0.965624
H  -2.125667 -2.684272 -0.294998
H  -4.647995 0.452234 -1.409389
H  -0.840914 -1.206764 1.268154
H  -3.315575 -1.627049 2.037031
H  -4.190686 -2.7330 0.954653
H  -5.64376 -1.001037 0.281459
H  -4.826245 0.136381 1.37876
H  -2.394308 1.515784 -1.123006
H  -3.482282 2.027828 0.195951
H  -2.48579 0.468752 1.777458
H  -0.491717 0.194087 -1.421301
H  -0.348044 -1.593662 -1.361929
H  -3.280787 -2.80185 -2.474881
H  -4.359668 -1.462534 -2.951828
H  -4.78106 -2.487714 -1.538758
H  -0.353119 1.837704 0.412661
H  3.484847 2.603403 -0.085264
H  3.130734 -1.674342 0.505816
H  5.907712 2.508463 0.624405
H  5.543653 -1.784807 1.21971
H  6.928523 0.307982 1.276248
