program: Gaussian 09
title: 000221241
version: EM64L-G09RevD.01
frameworkgroup: C1[X(C6H13NO5)]
method: RPBEPBE
basis: SDD
operation: Freq
keyword: #p
keyword: freq=noraman
keyword: PBEPBE/SDD
title: #p freq=noraman PBEPBE/SDD
converged: YES YES NO NO
title: Mulliken charges:
elementType: O O O O O N C C C C C C H H H H H H H H H H H H H
charge: -0.444286 -0.501234 -0.515828 -0.440460 -0.231867 -0.539507 -0.113397 -0.149292 -0.171930 -0.312951 0.193318 -0.497079 0.228834 0.235401 0.245118 0.205603 0.208125 0.291853 0.238437 0.361158 0.393699 0.384794 0.360928 0.280631 0.289933
chargesum: 0.00000
title: Mulliken charges with hydrogens summed into heavy atoms:
elementType: O O O O O N C C C C C C
charge: -0.083128 -0.107535 -0.131034 -0.079532 -0.231867 0.031056 0.115436 0.086109 0.073187 0.100778 0.193318 0.033211
polarizability: 1.10395943e+02 7.21448838e-01 8.40367670e+01 -2.61030887e+00 4.88805028e+00 7.22866463e+01
1716.lowfreq: -8.6327 -0.0011 -0.0009 -0.0005 4.4764 9.6789 50.8564 71.5135 78.1860
frequency: 50.7263 71.4731 78.1724 87.6016 113.8899 138.7621 172.3045 185.8100 221.9861 260.0120 273.9053 287.3583 321.6195 354.5454 421.0344 440.4027 487.8272 505.2042 528.9020 579.3323 628.1153 658.3107 714.1655 731.2932 768.5495 805.1962 822.7362 867.1223 898.9138 940.3080 979.4921 1011.3714 1036.1622 1043.5614 1060.3169 1103.7030 1135.8813 1158.9602 1168.4372 1192.7283 1217.1934 1254.9232 1270.8048 1294.8107 1321.1111 1323.3478 1331.7100 1334.7413 1357.5567 1362.3018 1389.2340 1413.7174 1429.4868 1468.0870 1616.0257 1658.7265 2953.1144 2970.8906 2972.9638 2995.9377 3026.0943 3029.0858 3075.8158 3327.6191 3349.6521 3429.1846 3469.0137 3523.4702 3589.2698
redmass: 3.9513 4.5399 4.3483 2.8468 5.3369 3.0610 4.2348 1.6953 2.6200 4.6838 4.9573 5.4429 4.3228 4.6802 4.1668 3.1597 1.1340 2.3997 1.2274 1.1621 2.0187 2.1599 2.9762 1.7427 2.4008 3.0014 3.3539 2.3752 2.7022 2.5008 4.8877 2.4736 3.1155 4.7641 2.0309 2.1211 1.7974 2.3901 1.1634 1.2522 1.3851 1.2303 1.3257 1.2499 1.2465 1.3653 1.2321 1.2664 1.3517 1.2173 1.2147 1.5168 1.1134 1.0908 8.4335 1.0853 1.0812 1.0626 1.0676 1.0829 1.0978 1.0858 1.0982 1.0650 1.0637 1.0643 1.0458 1.0650 1.0970
irintensity: 0.0133 1.6648 4.3058 5.7730 6.7290 2.7514 6.5618 40.5237 22.1485 1.7727 12.7555 21.9823 9.3229 47.6448 3.7822 14.1280 96.8067 20.9219 205.4841 54.3266 115.3529 152.3558 103.1494 102.8671 113.0039 59.4187 24.6237 24.9250 10.7700 49.6806 66.8142 27.8991 14.1868 76.4202 38.4434 38.3097 36.2428 9.5524 23.7096 41.0924 22.0185 5.8008 8.2308 32.9926 29.9610 26.4208 1.9639 32.1566 72.3657 77.0158 60.1198 52.3122 19.0368 4.8156 76.7394 39.4460 18.3285 26.1920 32.3003 41.8241 4.9418 34.1041 33.9591 233.5864 32.7480 48.9850 3.9322 14.8294 4.9796
temp: 298.150 k
press: 1.00000 atm
elementType: 8 8 8 8 8 7 6 6 6 6 6 6 1 1 1 1 1 1 1 1 1 1 1 1 1
symmnumber: 1
zpe: 526728.2 jmol-1
zpe.correction: 0.200620 hartree
zpe.thermalcorrener: 0.214498 hartree
zpe.thermalcorrenthalpy: 0.215442 hartree
zpe.thermalcorrgfe: 0.160062 hartree
zpe.sumelectzpe: -666.283982 hartree
zpe.sumelectthermal: -666.270105 hartree
zpe.sumelectthermalent: -666.269160 hartree
zpe.sumelectthermalfe: -666.324541 hartree
dipole: -2.7820 0.4035 -1.4816
dipole: 3.1776
quadrupole: -89.2501 -76.2900 -68.7504
quadrupole: 0.8754 4.4166 2.3332
quadrupole: -11.1533 1.8068 9.3464 0.8754 4.4166 2.3332
hfenergy: -666.4846026 hartree
pointgroup: C01 [X(C6H13N1O5)]
dipole: 1.1185465 0.4599863 -0.3165552 debye
dipolederiv: -0.6391791 0.0762735 0.0814547 -0.0229529 -0.5777671 0.1778791 0.1831325 0.1928675 -0.4637606 -0.739154 0.0472132 -0.1045028 0.0608629 -0.6234842 -0.1460487 -0.0691105 -0.1552142 -0.6057354 -0.6768619 -0.1165431 -0.0811103 -0.1072812 -0.482658 -0.0342929 -0.0114023 -0.1115493 -0.7535944 -0.9014037 -0.0639908 -0.0356934 -0.1333378 -0.2896431 0.123739 -0.0341378 0.1149091 -0.5269929 -0.6929673 0.1331905 0.0374377 0.2580539 -0.5013103 -0.2697992 -0.0227026 -0.2267083 -0.6155404 -0.7215211 -0.0161865 -0.2995201 -0.0413646 -0.3063717 -0.1663423 -0.3424437 -0.1533831 -0.5746463 0.2960462 0.0347541 -0.0889441 0.1191687 0.4339803 -0.1341459 -0.237743 -0.1019513 0.2548688 0.1872898 -0.0294474 0.0044987 -0.0869054 0.4093927 0.1076079 0.1740537 0.1416277 0.2764989 -0.2739391 0.1552435 0.0246009 0.2555029 0.3036682 0.1029112 -0.0415354 0.132504 0.3159202 0.5431315 0.0227448 0.1669871 0.0371153 0.2823024 -0.0217172 0.0150972 -0.0370532 0.3561406 0.7609219 -0.2218139 0.0107713 -0.3569137 0.3866177 0.3027956 0.1576624 0.2795408 0.552935 0.5279109 -0.0471966 0.1545289 -0.1151539 0.1635502 -0.0932541 0.0457192 -0.0822839 -0.0079613 0.0703579 -0.0526386 -0.0227733 -0.0451494 -0.0827518 -0.0521577 -0.0279255 -0.0939039 -0.0383126 0.054637 -0.0065424 -0.0148168 -0.002521 -0.1124988 0.0646052 0.0144073 0.0971934 -0.0567531 0.0546945 -0.0210835 -0.0085771 -0.0559083 -0.1361469 -0.0008236 -0.0081177 0.0273208 0.0142488 0.0405761 -0.025174 -0.0282594 -0.0370564 -0.0910645 -0.1072982 -0.0279293 -0.0632948 0.0432507 -0.0059772 0.0279588 -0.0632622 0.0262774 -0.0403564 0.1509214 -0.0460038 0.0841095 -0.066567 -0.0036744 -0.0257445 0.0261813 -0.0347567 0.1036175 0.0369795 0.0805956 0.0200764 0.0531565 0.0377887 0.0494835 -0.0565012 0.0908096 -0.0999351 0.0218956 -0.0535047 0.0449398 0.0886754 0.3634227 -0.0920891 -0.0033464 -0.0459208 0.2823285 -0.0512319 -0.0466669 -0.1102901 0.2605811 0.5641765 0.018434 0.0520099 0.040102 0.2728053 0.0042037 0.0000133 0.0108403 0.3281101 0.3487666 0.0797501 0.1487651 -0.0228375 0.2833448 -0.0411569 0.0315389 0.0189238 0.4058211 0.4328421 0.0557115 -0.0123452 0.0630873 0.1517093 -0.1168886 -0.0475149 -0.102894 0.2835234 0.1899889 0.0365291 0.0670686 0.1185156 0.2287968 0.0869002 0.1880261 0.1058145 0.1327036 0.1821265 -0.018836 0.0453481 0.0385639 0.041874 0.0547188 0.1264918 -0.0321414 0.34343 unknown
polarizability: 110.104276|-3.6165745|76.7093943|2.3938461|7.3292054|79.9056861 unknown
InChI: InChI=1S/C6H13NO5/c7-1-3(9)5(11)6(12)4(10)2-8/h4-6,8,10-12H,1-2,7H2
charge 0 multiplicity 1
25 atoms
O  -0.314399 -0.958201 1.162299
O  -2.24953 -0.858826 -0.764939
O  0.140639 -0.347068 -1.853945
O  -4.326111 0.544548 0.396382
O  2.548876 -0.877216 -0.984118
N  3.976803 0.18343 1.279348
C  -0.479196 0.313663 0.455266
C  -1.924284 0.423662 -0.099001
C  0.559863 0.446586 -0.692376
C  -2.991503 0.598367 0.989912
C  1.964824 -0.024663 -0.259272
C  2.590129 0.55256 1.01649
H  -0.293412 1.10912 1.201094
H  -1.998584 1.254948 -0.829274
H  0.621971 1.514833 -0.994971
H  -2.907487 1.592994 1.460134
H  -2.860277 -0.183518 1.76683
H  1.95241 0.212314 1.856915
H  2.488021 1.657069 0.988849
H  -0.905347 -1.607581 0.684793
H  -1.589108 -0.937941 -1.518586
H  0.933327 -0.911285 -2.101533
H  -4.333588 -0.25121 -0.199421
H  4.636273 0.4903 0.557512
H  4.102688 -0.810385 1.493609
