program: Gaussian 09
title: 000221238
version: EM64L-G09RevD.01
frameworkgroup: C1[X(C18H27N3O)]
method: RPBEPBE
basis: SDD
operation: Freq
keyword: #p
keyword: freq=noraman
keyword: PBEPBE/SDD
title: #p freq=noraman PBEPBE/SDD
converged: YES YES NO NO
title: Mulliken charges:
elementType: O N N N C C C C C C C C C C C C C C C C C C H H H H H H H H H H H H H H H H H H H H H H H H H H H
charge: -0.264917 -0.109651 -0.330782 -0.012622 -0.349647 -0.413989 -0.363838 -0.318110 -0.319745 -0.470371 0.391524 -0.261815 -0.679406 -0.675726 0.474347 -0.551061 0.333941 -0.576526 -0.332706 -0.183905 -0.385604 -0.534978 0.215986 0.189777 0.196663 0.184189 0.189073 0.236266 0.183775 0.200579 0.204166 0.184035 0.242204 0.248213 0.229552 0.198304 0.231167 0.219605 0.225040 0.208120 0.204781 0.288446 0.255933 0.243848 0.226625 0.237405 0.244254 0.225595 0.221987
chargesum: 0.00000
title: Mulliken charges with hydrogens summed into heavy atoms:
elementType: O N N N C C C C C C C C C C C C C C C C C C
charge: -0.264917 -0.109651 -0.088578 -0.012622 0.056117 -0.033137 0.061501 0.066244 0.068455 0.007394 0.391524 -0.261815 -0.030330 -0.037785 0.474347 -0.262615 0.333941 -0.320593 -0.088858 0.042719 -0.148199 0.156858
polarizability: 2.87936162e+02 -2.60447167e+01 2.52323137e+02 2.17795988e+01 -6.65507583e+00 1.50826943e+02
1716.lowfreq: -12.7818 -6.4359 -5.7613 -0.0006 -0.0004 -0.0001 8.3924 14.7663 21.5037
frequency: 2.5455 14.5461 21.4866 45.1521 51.8850 71.6087 82.8837 93.7312 108.5411 122.7221 150.0279 155.1106 167.5393 188.0293 202.4323 212.8097 219.0324 243.9490 253.8338 281.1863 287.4346 299.9192 308.7748 341.9228 359.3291 408.7335 425.7937 428.1583 450.7080 461.3694 508.4992 519.8382 528.4014 570.1296 585.9187 608.2486 628.0704 660.1857 698.9696 725.6966 757.6002 789.9633 794.3656 796.3866 809.7642 828.3251 868.7101 877.5383 881.7670 901.0105 903.6420 922.2507 932.4236 938.1304 960.5483 983.5694 992.9587 1010.4353 1019.4627 1035.5936 1046.1758 1063.1374 1074.3627 1084.9032 1089.2329 1091.8653 1111.7250 1113.2370 1121.4656 1139.0453 1154.4022 1162.1022 1163.3494 1176.3742 1205.9811 1209.4825 1226.7705 1249.5131 1253.7450 1279.7761 1281.8012 1289.5568 1292.8802 1317.0165 1345.6951 1347.2009 1355.2649 1360.1595 1367.3955 1372.0770 1380.4399 1385.6010 1387.7999 1389.0323 1427.9072 1436.1466 1441.7030 1455.1616 1457.7788 1458.8815 1461.5632 1466.9162 1468.3740 1472.4288 1473.6128 1478.2233 1479.4299 1485.7765 1489.0032 1490.4782 1492.9552 1563.4899 1590.6335 1625.9932 2843.4759 2851.4394 2869.2558 2878.2845 2936.3027 2962.2466 2967.3007 2977.0530 2982.6623 2992.9205 3019.2969 3022.2731 3030.5510 3031.6015 3051.2130 3054.5572 3071.8449 3075.2281 3084.1067 3090.7503 3118.0875 3124.0976 3129.4232 3151.0390 3151.6700 3162.8051 3401.8721
redmass: 4.0391 4.4065 3.4562 3.7369 3.5839 3.3421 2.2713 2.1254 3.3922 3.8101 2.3438 2.4249 2.3798 3.1812 1.8816 1.3010 1.4201 1.8315 2.6921 2.4350 2.8498 2.0114 3.9065 2.3798 3.7929 3.7991 3.6825 3.0270 2.5552 2.5426 4.7294 3.4612 3.2729 3.7045 4.4771 5.3475 5.6635 2.6969 2.4226 1.6409 3.3730 1.1787 1.3858 1.1459 3.0360 1.5719 4.7349 3.0263 1.6669 1.5200 1.7708 4.8621 1.4697 1.8426 1.9351 1.3756 1.8314 3.3741 3.9320 2.4522 2.2548 2.3418 2.0246 2.0745 2.3040 1.8771 1.2592 1.9505 1.8103 2.8678 1.3117 1.4505 1.5845 1.4639 2.0940 1.6765 1.6102 1.3984 1.3441 1.1416 2.7242 1.3092 1.2276 1.5349 1.4575 2.6092 1.4848 1.3967 1.4122 1.6710 1.5986 1.2426 2.4340 1.3140 2.3496 1.1809 1.7626 2.1543 1.0658 1.1147 1.0539 1.0513 1.1330 1.0625 1.0867 1.0687 1.0556 1.0873 1.1968 2.2951 1.2196 6.9379 6.1270 6.9516 1.0720 1.0719 1.0712 1.0707 1.0649 1.0328 1.0640 1.0358 1.0357 1.0929 1.0906 1.0865 1.0931 1.0876 1.1041 1.0891 1.0987 1.0982 1.0999 1.1003 1.0885 1.0997 1.0904 1.0916 1.0902 1.0992 1.0736
irintensity: 0.1227 0.1438 0.0180 0.7077 0.0270 3.0821 0.3201 0.2061 2.2046 9.5953 2.6973 1.1185 1.2008 4.0151 1.2336 1.2855 1.9299 0.4016 4.2653 3.5850 1.0258 0.4463 5.1529 0.4097 1.1581 2.8279 1.4166 1.7459 2.4990 3.6412 2.3115 3.8804 3.6336 1.6434 11.7984 4.7074 6.7494 1.1816 24.9210 43.7577 4.9627 8.3076 32.0114 4.3098 1.8054 9.5050 3.3495 0.9485 42.7736 17.2761 11.6287 14.2238 0.7878 3.0873 0.8368 2.1369 14.7051 38.5514 25.3461 7.2594 22.2540 19.5525 9.6587 0.5902 20.6009 2.2824 0.0940 6.8396 41.2082 85.5258 6.0159 68.8258 63.9050 10.3098 17.7616 11.4371 12.8046 16.3979 6.6529 5.7630 95.5157 14.0971 21.5008 52.4595 9.6071 11.8668 8.4949 0.4046 5.1167 10.0275 10.8950 21.8994 10.1505 11.9610 13.7466 28.0724 11.4996 25.5797 3.3567 9.3899 4.9244 13.8663 23.0560 3.0051 33.8779 9.6765 4.5897 20.9264 37.8321 31.4697 13.9936 24.2184 12.3152 106.4354 45.2663 86.3621 217.7664 98.1037 26.2460 74.7139 66.5459 28.5575 33.6739 14.0436 16.4590 18.7284 46.6699 13.2860 45.5550 38.2471 46.4799 66.1856 35.5896 45.4273 17.0830 29.7212 14.1899 2.4005 8.5218 39.0464 1.6873
temp: 298.150 k
press: 1.00000 atm
elementType: 8 7 7 7 6 6 6 6 6 6 6 6 6 6 6 6 6 6 6 6 6 6 1 1 1 1 1 1 1 1 1 1 1 1 1 1 1 1 1 1 1 1 1 1 1 1 1 1 1
symmnumber: 1
zpe: 1101377.7 jmol-1
zpe.correction: 0.419493 hartree
zpe.thermalcorrener: 0.442767 hartree
zpe.thermalcorrenthalpy: 0.443711 hartree
zpe.thermalcorrgfe: 0.362254 hartree
zpe.sumelectzpe: -939.870567 hartree
zpe.sumelectthermal: -939.847293 hartree
zpe.sumelectthermalent: -939.846349 hartree
zpe.sumelectthermalfe: -939.927806 hartree
dipole: -1.2139 1.3494 -0.9485
dipole: 2.0479
quadrupole: -119.4894 -130.0163 -133.1061
quadrupole: -5.2545 4.6451 -0.6035
quadrupole: 8.0479 -2.4791 -5.5688 -5.2545 4.6451 -0.6035
hfenergy: -940.2900594 hartree
pointgroup: C01 [X(C18H27N3O1)]
dipole: 0.2381999 -0.7393192 0.2141412 debye
polarizability: 259.1418474|-50.9352287|224.3461291|-5.5267357|-54.2415652|207.5982649 unknown
InChI: InChI=1S/C18H27N3O/c1-4-21(5-2)11-7-9-19-14-16-13-17(22-3)12-15-8-6-10-20-18(15)16/h6,8,10,12-13,19H,4-5,7,9,11,14H2,1-3H3
charge 0 multiplicity 1
49 atoms
O  -2.906501 -1.365184 2.255937
N  4.139497 -1.165909 0.418936
N  0.725359 -0.640209 -1.321109
N  -2.233696 2.417655 -1.869114
C  3.170465 -2.12924 -0.170049
C  2.884593 -1.843227 -1.66194
C  2.101713 -0.531138 -1.865213
C  3.872159 -0.885414 1.85557
C  5.551677 -1.543714 0.145258
C  -0.055722 0.617341 -1.392673
C  -1.345163 0.550147 -0.58493
C  -2.409327 1.483041 -0.854895
C  2.695077 0.089352 2.057169
C  6.518418 -0.344422 0.185629
C  -3.622707 1.422288 -0.057636
C  -1.503055 -0.394041 0.435471
C  -2.701353 -0.444329 1.216731
C  -3.750663 0.450018 0.974771
C  -4.654772 2.375473 -0.354402
C  -4.46205 3.308243 -1.373573
C  -3.231207 3.289745 -2.107345
C  -1.82191 -2.300517 2.567421
H  2.212766 -2.039304 0.372266
H  3.522201 -3.184079 -0.046661
H  3.836146 -1.782936 -2.225611
H  2.315471 -2.693989 -2.094332
H  2.110075 -0.253204 -2.947761
H  2.628234 0.27006 -1.312487
H  3.684154 -1.831531 2.425289
H  4.782151 -0.43571 2.293673
H  5.588407 -1.988743 -0.866876
H  5.906417 -2.339859 0.849949
H  0.213746 -1.411244 -1.778003
H  -0.302833 0.93865 -2.428212
H  0.577827 1.428464 -0.97928
H  2.486309 0.233521 3.134408
H  1.773341 -0.278362 1.570412
H  2.935546 1.0703 1.610521
H  6.206005 0.418973 -0.548112
H  6.542203 0.132466 1.182043
H  7.548564 -0.668752 -0.054258
H  -0.668687 -1.080431 0.609913
H  -4.657056 0.393983 1.586425
H  -5.583749 2.358828 0.227464
H  -5.229949 4.047605 -1.62252
H  -3.061791 4.011587 -2.915744
H  -2.197397 -2.899943 3.409798
H  -0.901054 -1.76556 2.870416
H  -1.599578 -2.962652 1.708571
