program: Gaussian 09
title: 000221216
version: EM64L-G09RevD.01
frameworkgroup: C1[X(C13H11NO3)]
method: RPBEPBE
basis: SDD
operation: Freq
keyword: #p
keyword: freq=noraman
keyword: PBEPBE/SDD
title: #p freq=noraman PBEPBE/SDD
converged: YES YES NO NO
title: Mulliken charges:
elementType: O O O N C C C C C C C C C C C C C H H H H H H H H H H H
charge: -0.430212 -0.432144 -0.349891 -0.469245 0.395565 0.251363 0.184614 -0.395713 0.177094 -0.496081 -0.379132 0.325763 -0.332707 -0.345195 -0.219626 -0.237471 -0.224430 0.318438 0.216185 0.248248 0.253805 0.280039 0.213623 0.236771 0.233704 0.236748 0.382317 0.357570
chargesum: 0.00000
title: Mulliken charges with hydrogens summed into heavy atoms:
elementType: O O O N C C C C C C C C C C C C C
charge: -0.047896 -0.074574 -0.349891 -0.150807 0.395565 0.251363 0.184614 -0.179528 0.177094 -0.247833 -0.125326 0.325763 -0.052667 -0.131572 0.017145 -0.003768 0.012319
polarizability: 3.10933286e+02 5.88342906e+00 1.57054014e+02 -3.28633119e+00 -4.54593598e+00 7.04102553e+01
1716.lowfreq: -3.3408 -0.0004 0.0001 0.0004 3.1027 7.1644 25.4433 41.2510 52.9407
frequency: 25.3927 41.2444 52.9335 100.9779 131.1429 185.4115 214.1538 233.9073 266.6609 307.2733 349.4657 370.7174 375.0158 401.2157 433.1959 457.6117 468.8075 498.8505 538.5148 559.9620 611.1029 614.2462 652.9947 668.6062 682.0605 695.5395 701.7628 723.4275 775.9859 790.0028 794.0270 832.9660 851.2267 865.1026 913.6734 933.8033 960.0897 983.7436 985.3050 989.3163 1007.9288 1024.9537 1084.9531 1093.2618 1118.1796 1139.2308 1175.4957 1186.5008 1193.7370 1211.7106 1244.0716 1297.8688 1309.0318 1320.9376 1372.7949 1387.0010 1412.7286 1433.7714 1473.4702 1479.3371 1500.2435 1520.1305 1574.2389 1595.6740 1604.5642 1611.8360 1638.3600 2664.2273 3109.2126 3113.0046 3135.8432 3145.9682 3149.0575 3163.2200 3174.7521 3186.1226 3518.0246 3583.2977
redmass: 5.0693 5.7472 5.6550 6.0535 4.9027 5.2267 6.0945 6.8510 5.9700 8.2689 4.4502 2.0521 1.7367 2.8037 4.0769 3.2644 6.1537 4.8669 6.4737 6.8598 4.2300 6.3621 1.7282 5.0298 2.7754 3.0794 1.5508 7.4682 3.2358 1.5168 2.8243 1.6404 1.3013 5.4430 1.3362 1.4291 2.9000 1.4135 1.2388 4.3734 1.3455 2.4562 2.0698 2.4005 1.6100 1.5594 1.0582 1.4326 1.1318 2.6050 1.7124 3.0877 2.3099 1.3697 2.9387 8.1112 3.7146 2.3379 2.5177 2.3330 2.8852 2.4045 3.0734 5.2319 4.6260 5.3735 4.5143 1.0825 1.0901 1.0885 1.0869 1.0918 1.0921 1.0962 1.0998 1.0948 1.0755 1.0660
irintensity: 0.0898 0.8312 0.7255 1.1482 3.0161 3.0916 0.2932 1.5773 12.3761 6.2271 1.9678 53.9171 90.8417 0.2458 1.6750 16.8023 5.4228 20.2682 59.7996 1.9013 11.5112 0.9656 7.7753 16.7508 15.2104 0.6820 111.7278 7.3044 19.1826 23.1788 26.2579 70.6114 0.8147 9.0643 0.3172 3.2965 45.6362 34.5845 76.7148 4.8490 1.5875 11.6581 25.4503 3.2706 11.4251 372.6551 0.5794 10.5835 5.5983 1.1151 40.5667 115.4981 38.1897 0.1954 65.3265 6.0631 65.4290 2.7902 68.8428 28.7696 211.4235 105.4418 30.8486 17.0681 112.5353 33.0648 230.6287 715.5766 16.1481 13.2661 0.3695 7.2688 20.1255 16.0564 17.0475 3.8768 12.9952 64.7491
temp: 298.150 k
press: 1.00000 atm
elementType: 8 8 8 7 6 6 6 6 6 6 6 6 6 6 6 6 6 1 1 1 1 1 1 1 1 1 1 1
symmnumber: 1
zpe: 556216.7 jmol-1
zpe.correction: 0.211852 hartree
zpe.thermalcorrener: 0.225967 hartree
zpe.thermalcorrenthalpy: 0.226912 hartree
zpe.thermalcorrgfe: 0.169567 hartree
zpe.sumelectzpe: -781.230258 hartree
zpe.sumelectthermal: -781.216142 hartree
zpe.sumelectthermalent: -781.215198 hartree
zpe.sumelectthermalfe: -781.272543 hartree
dipole: 3.0332 -3.2845 -0.1610
dipole: 4.4738
quadrupole: -79.0438 -97.2167 -103.7030
quadrupole: -9.1912 -1.6984 -3.1629
quadrupole: 14.2774 -3.8956 -10.3818 -9.1912 -1.6984 -3.1629
hfenergy: -781.4421098 hartree
pointgroup: C01 [X(C13H11N1O3)]
dipole: -1.2242462 -0.0133645 1.2645295 debye
polarizability: 310.5001401|-5.3883243|71.4796662|9.2774464|-10.4602659|156.4177495 unknown
InChI: InChI=1S/C13H11NO3/c15-10-6-7-11(12(16)8-10)14-13(17)9-4-2-1-3-5-9/h1-8,14-16H
charge 0 multiplicity 1
28 atoms
O  1.731915 -0.278476 -2.267546
O  5.648597 0.125082 0.543781
O  -0.696231 0.369242 -1.986471
N  -0.016463 0.092043 0.241296
C  1.421825 0.122034 0.181653
C  -2.406047 0.14002 -0.292208
C  2.219635 -0.060168 -1.000381
C  2.07958 0.301503 1.429135
C  -0.977019 0.200201 -0.739053
C  3.632771 -0.049577 -0.868993
C  3.476249 0.301443 1.552291
C  4.253501 0.121653 0.38246
C  -3.383818 0.672666 -1.17241
C  -2.82129 -0.437405 0.938754
C  -4.747722 0.655146 -0.817317
C  -4.187828 -0.456382 1.290288
C  -5.154029 0.095695 0.417194
H  -0.374628 0.060902 1.19926
H  1.471248 0.446402 2.332059
H  4.212537 -0.18855 -1.788683
H  3.97023 0.437342 2.516918
H  -3.047548 1.088194 -2.127259
H  -2.101334 -0.919705 1.612384
H  -5.493409 1.074133 -1.501295
H  -4.499984 -0.913098 2.235529
H  -6.214287 0.07888 0.69199
H  0.725937 -0.019232 -2.327256
H  6.102912 -0.007588 -0.32502
