program: Gaussian 09
title: 000221213
version: EM64L-G09RevD.01
frameworkgroup: C1[X(C12H17NO)]
method: RPBEPBE
basis: SDD
operation: Freq
keyword: #p
keyword: freq=noraman
keyword: PBEPBE/SDD
title: #p freq=noraman PBEPBE/SDD
converged: YES YES NO NO
title: Mulliken charges:
elementType: O N C C C C C C C C C C C C H H H H H H H H H H H H H H H H H
charge: -0.478193 -0.155513 -0.421651 -0.398228 -0.441412 -0.439648 -0.415146 -0.181542 0.451818 -0.424676 -0.403735 -0.230830 -0.220076 -0.244028 0.237727 0.219125 0.237292 0.218299 0.229635 0.221259 0.224147 0.228011 0.209594 0.241581 0.197580 0.362646 0.225484 0.282240 0.221308 0.222189 0.224743
chargesum: 0.00000
title: Mulliken charges with hydrogens summed into heavy atoms:
elementType: O N C C C C C C C C C C C C
charge: -0.115547 -0.155513 0.035201 0.057363 0.009483 0.012510 0.036029 0.016038 0.451818 -0.199191 -0.121495 -0.009522 0.002112 -0.019285
polarizability: 1.76053616e+02 4.13528285e+00 1.27813267e+02 -1.29889596e+01 9.37387109e+00 9.87660383e+01
1716.lowfreq: -25.4250 -1.9850 0.0003 0.0005 0.0006 5.2272 29.6481 38.1136 53.0668
frequency: 28.6461 37.6870 52.2696 64.8424 85.4138 135.5896 197.2179 217.9970 251.8577 364.9088 386.3609 392.6945 404.7247 498.5804 544.4959 599.9121 615.5767 625.5329 661.5721 701.4716 709.9470 749.7859 762.4352 809.6416 840.1547 847.5455 857.7700 881.9492 893.2738 919.5329 924.3319 938.3149 979.9411 989.0646 998.6501 1012.8169 1019.2913 1023.8598 1038.2357 1055.2702 1070.0139 1084.9024 1110.8820 1169.2247 1176.1599 1178.4451 1187.2702 1205.1415 1220.2025 1235.4016 1256.9786 1268.4817 1287.1007 1292.3425 1301.7831 1314.4808 1316.6404 1325.5610 1337.0413 1386.1395 1396.9712 1437.3941 1446.6347 1466.3858 1471.5659 1476.9856 1482.7397 1489.8578 1593.6357 1614.3501 2905.2764 2938.9343 2992.7558 3003.5872 3007.8023 3022.4125 3054.2634 3059.0610 3075.2292 3082.1317 3094.0856 3106.8271 3122.9580 3136.7784 3155.4256 3170.6506 3225.0144
redmass: 3.3256 2.9907 2.4859 3.2599 2.9088 3.0762 4.3681 4.6758 3.7044 3.8845 2.3060 2.1699 2.8601 3.9192 2.8095 4.5624 6.2879 2.3418 2.7767 1.2944 1.4819 1.8740 1.9497 2.0165 2.4239 2.2405 1.2509 3.2916 2.5605 2.4462 1.5035 1.5990 1.3631 5.7540 1.4137 2.6161 2.8574 2.2889 3.0325 2.0695 2.2114 1.7383 1.9837 1.0665 1.2656 1.1606 1.2295 2.3088 1.1949 1.3533 1.3926 1.1887 1.3078 1.1945 1.3122 1.3996 1.2431 1.2402 1.3026 7.0260 1.5789 2.1760 1.0879 1.0826 1.0818 1.0985 2.3285 1.0973 6.2370 6.1504 1.0825 1.0663 1.0653 1.0619 1.0608 1.0645 1.0959 1.1015 1.1011 1.1021 1.1057 1.0873 1.0865 1.0928 1.0979 1.0965 1.0634
irintensity: 0.1784 0.5444 0.9897 0.2723 1.8498 1.5377 3.1936 4.2911 2.0449 10.5441 0.3417 1.4308 0.1705 3.7580 8.1938 19.3112 0.0554 3.0042 9.2248 12.3474 123.7204 19.8373 45.5312 4.0439 10.5431 15.2368 0.3874 10.5519 12.3910 0.4537 6.1769 17.4979 0.3125 0.0648 2.5217 6.6452 17.1025 24.9159 37.7585 26.4263 32.4303 18.7060 13.7792 0.6741 2.6165 4.5687 8.6706 24.3393 4.4462 22.2833 4.5260 14.6439 3.2564 13.6719 4.0507 6.1026 19.2230 18.0872 6.0752 6.8530 89.8492 13.3753 13.4670 1.7154 13.6295 9.0784 13.8063 8.4104 0.4097 8.5406 50.6404 42.9997 46.6355 20.6935 53.5608 50.2995 9.4234 18.0349 2.4818 19.5322 96.1600 12.9886 1.4238 36.3472 31.4380 10.3950 221.1153
temp: 298.150 k
press: 1.00000 atm
elementType: 8 7 6 6 6 6 6 6 6 6 6 6 6 6 1 1 1 1 1 1 1 1 1 1 1 1 1 1 1 1 1
symmnumber: 1
zpe: 699056.2 jmol-1
zpe.correction: 0.266256 hartree
zpe.thermalcorrener: 0.279350 hartree
zpe.thermalcorrenthalpy: 0.280294 hartree
zpe.thermalcorrgfe: 0.224483 hartree
zpe.sumelectzpe: -596.362035 hartree
zpe.sumelectthermal: -596.348941 hartree
zpe.sumelectthermalent: -596.347997 hartree
zpe.sumelectthermalfe: -596.403808 hartree
dipole: 3.1240 -2.4792 1.1758
dipole: 4.1579
quadrupole: -74.4296 -85.8219 -85.9042
quadrupole: 2.3033 -3.1685 5.5525
quadrupole: 7.6223 -3.7700 -3.8523 2.3033 -3.1685 5.5525
hfenergy: -596.628291 hartree
pointgroup: C01 [X(C12H17N1O1)]
dipole: -1.2805204 -0.8662293 -0.5347294 debye
polarizability: 174.4017799|-3.7304453|130.0153971|-17.3289194|-4.3858516|98.2157447 unknown
InChI: InChI=1S/C12H17NO/c14-12(10-13-8-4-5-9-13)11-6-2-1-3-7-11/h1-3,6-7,12,14H,4-5,8-10H2
charge 0 multiplicity 1
31 atoms
O  0.064218 1.765268 1.102025
N  -2.198575 0.633605 0.217715
C  -3.182104 0.896827 -0.875496
C  -2.980694 -0.184314 1.200631
C  -3.982323 -0.430822 -1.058566
C  -3.949841 -1.090118 0.360426
C  -0.928704 -0.014338 -0.225534
C  0.185637 0.341784 0.811833
C  1.569666 0.012047 0.273175
C  2.02551 -1.330509 0.265437
C  2.401107 1.027586 -0.257357
C  3.287548 -1.65705 -0.279621
C  3.665712 0.702281 -0.798148
C  4.111892 -0.640005 -0.815891
H  -2.667852 1.237731 -1.789153
H  -3.862048 1.704568 -0.542832
H  -3.559908 0.501297 1.846074
H  -2.298626 -0.759895 1.848972
H  -3.484114 -1.079457 -1.801305
H  -5.011017 -0.246023 -1.413488
H  -4.953014 -1.119559 0.820368
H  -3.582885 -2.129776 0.305721
H  -1.003537 -1.117116 -0.348742
H  -0.643554 0.425586 -1.198037
H  0.006377 -0.249413 1.739874
H  -0.925591 1.930998 0.981761
H  1.399105 -2.122657 0.696556
H  2.046388 2.061626 -0.214598
H  3.630807 -2.698072 -0.279038
H  4.306674 1.496023 -1.199349
H  5.09395 -0.890302 -1.233313
