program: Gaussian 09
title: 000221211
version: EM64L-G09RevD.01
frameworkgroup: C1[X(C11H16N2O2S)]
method: RPBEPBE
basis: SDD
operation: Freq
keyword: #p
keyword: freq=noraman
keyword: PBEPBE/SDD
title: #p freq=noraman PBEPBE/SDD
converged: YES YES NO NO
title: Mulliken charges:
elementType: S O O N N C C C C C C C C C C C H H H H H H H H H H H H H H H H
charge: 0.969345 -0.546314 -0.543641 -0.417154 -0.227156 -0.530960 0.372504 -0.402284 0.285353 -0.394857 -0.154020 -0.414027 -0.415902 -0.219634 -0.623375 -0.621329 0.228076 0.235298 0.212053 0.226344 0.218996 0.220919 0.299115 0.283364 0.226981 0.278107 0.275655 0.244704 0.207632 0.206105 0.244302 0.275801
chargesum: 0.00000
title: Mulliken charges with hydrogens summed into heavy atoms:
elementType: S O O N N C C C C C C C C C C C
charge: 0.969345 -0.546314 -0.543641 -0.118039 -0.227156 -0.067586 0.372504 0.036112 0.285353 0.045058 -0.154020 -0.130662 -0.188921 0.058472 0.104615 0.104879
polarizability: 2.39562610e+02 -1.36082951e+00 1.57556870e+02 1.77845628e+00 4.50342655e+00 1.21220888e+02
1716.lowfreq: -11.5648 -5.7039 -0.0010 0.0006 0.0011 7.5028 31.5033 48.6345 55.8091
frequency: 31.3123 48.5236 55.7378 86.3868 113.9141 138.3674 168.4793 204.9157 209.8089 219.9674 233.0135 249.8119 257.4066 295.9426 304.1784 318.1398 364.8214 389.2000 414.3197 424.2761 430.3546 434.7278 462.4223 476.1918 520.3144 557.7203 590.1669 649.1087 728.2320 735.3849 800.1198 813.5400 832.1680 856.8313 865.2568 881.0306 920.6766 937.4081 946.5216 950.9487 1010.0992 1015.3572 1057.9016 1079.6868 1080.1913 1111.9327 1112.7965 1136.9259 1170.1068 1179.3258 1190.2559 1197.9857 1205.9734 1241.1784 1276.0395 1302.9634 1325.1192 1339.4572 1348.5021 1387.1502 1403.4489 1415.4304 1423.6682 1452.5615 1457.7127 1463.9854 1464.8622 1467.8036 1476.3472 1478.1138 1482.1727 1517.5609 1584.2477 1609.9076 2908.9013 2912.9592 2939.8227 2969.7597 3004.2151 3034.5394 3035.3048 3037.1899 3043.7385 3071.9316 3094.5273 3096.0992 3123.4046 3134.9213 3159.6032 3570.1660
redmass: 3.7053 3.6431 3.0756 2.9693 6.9927 3.7556 2.8273 5.0687 2.7906 1.4058 1.5759 2.4967 5.9987 2.8651 2.1377 4.3133 4.1751 3.0554 4.5530 1.5358 2.4829 6.1023 2.6410 5.7739 5.4866 3.7977 4.2140 3.0658 3.4737 4.5818 10.9776 1.5403 4.0498 4.3764 1.5525 2.3937 1.3511 2.7925 1.4447 6.3018 2.4049 1.4297 2.3894 1.2306 1.7710 1.4745 2.0841 1.4826 5.1317 1.2764 1.3196 2.2693 1.6638 1.2936 1.2042 1.9773 1.4197 1.4492 1.4401 3.0332 1.1310 1.1475 4.1584 1.0476 1.1423 1.0529 1.1319 1.0454 1.6985 1.0908 1.2790 2.2791 6.0905 6.1426 1.0478 1.0469 1.0688 1.0659 1.0626 1.0932 1.0859 1.0845 1.0937 1.1041 1.0981 1.0993 1.0890 1.0916 1.0953 1.0772
irintensity: 1.5502 1.9103 0.1747 0.9662 1.0459 2.6026 0.7154 0.9155 3.1067 1.6721 5.0215 3.5921 0.9458 1.5322 3.2866 12.5056 0.1955 4.0788 28.6207 78.5512 21.8835 68.4106 16.0188 71.3074 18.4939 56.7372 4.5404 8.8168 0.1950 0.4348 69.7659 53.7356 32.2891 39.9481 7.8603 6.9360 8.2816 14.8310 4.6804 54.0722 10.7611 0.5444 50.6157 0.0152 9.1943 25.6140 7.1483 25.7262 12.5179 8.4605 15.5598 5.3016 15.0156 5.4005 2.2854 50.8786 13.7113 92.3900 23.9728 6.4564 22.7979 2.4971 11.7133 26.4108 13.7933 3.7016 12.2070 18.8576 9.1473 53.1559 21.6522 131.2339 48.0355 172.0486 25.3593 96.1889 103.4604 27.6917 19.0197 53.3188 3.2211 51.5019 34.0789 46.7390 2.3063 3.1787 15.1049 3.3128 5.4299 45.0644
temp: 298.150 k
press: 1.00000 atm
elementType: 16 8 8 7 7 6 6 6 6 6 6 6 6 6 6 6 1 1 1 1 1 1 1 1 1 1 1 1 1 1 1 1
symmnumber: 1
zpe: 673028.0 jmol-1
zpe.correction: 0.256343 hartree
zpe.thermalcorrener: 0.273047 hartree
zpe.thermalcorrenthalpy: 0.273991 hartree
zpe.thermalcorrgfe: 0.211974 hartree
zpe.sumelectzpe: -1085.389227 hartree
zpe.sumelectthermal: -1085.372522 hartree
zpe.sumelectthermalent: -1085.371578 hartree
zpe.sumelectthermalfe: -1085.433595 hartree
dipole: -8.5285 0.5102 5.3868
dipole: 10.1001
quadrupole: -98.1149 -97.3232 -108.3536
quadrupole: -2.7589 14.6538 0.5596
quadrupole: 3.1490 3.9407 -7.0897 -2.7589 14.6538 0.5596
hfenergy: -1085.6455696 hartree
pointgroup: C01 [X(C11H16N2O2S1)]
dipole: -3.3961417 -0.0017212 -2.0631113 debye
polarizability: 239.4818417|0.5862837|156.6719834|-3.8526639|7.1385831|122.1865426 unknown
InChI: InChI=1S/C11H16N2O2S/c1-13(2)16(14,15)10-5-6-11-9(8-10)4-3-7-12-11/h5-6,8,12H,3-4,7H2,1-2H3
charge 0 multiplicity 1
32 atoms
S  2.542944 -0.00768 0.700353
O  2.645945 1.321041 1.636759
O  3.221663 -1.435461 1.089744
N  -3.352378 -1.023251 -0.31291
N  3.399174 0.494151 -0.933819
C  -2.584406 1.629188 0.541695
C  -1.56014 0.521246 0.33147
C  -3.843809 1.400665 -0.32647
C  -2.002499 -0.782777 -0.079405
C  -4.40301 -0.01738 -0.085203
C  0.725271 -0.320318 0.3710
C  -0.186313 0.737708 0.545798
C  -1.049943 -1.835117 -0.243457
C  0.317218 -1.612434 -0.013254
C  3.345762 -0.623011 -1.904354
C  2.852846 1.780286 -1.423892
H  -2.882828 1.664693 1.609726
H  -2.132006 2.611275 0.312913
H  -4.622905 2.144639 -0.080781
H  -3.591207 1.516201 -1.397023
H  -4.798578 -0.085871 0.951487
H  -5.24303 -0.222188 -0.774376
H  -3.634546 -1.970582 -0.561755
H  0.177451 1.715709 0.882859
H  -1.393847 -2.833711 -0.539334
H  1.048506 -2.422932 -0.095407
H  3.646543 -1.552173 -1.392158
H  4.091235 -0.410912 -2.692665
H  2.35028 -0.759539 -2.386053
H  1.845853 1.696833 -1.893895
H  3.560588 2.173941 -2.176325
H  2.817165 2.492759 -0.582968
