program: Gaussian 09
title: 000221208
version: EM64L-G09RevD.01
frameworkgroup: C1[X(C11H12ClN3)]
method: RPBEPBE
basis: SDD
operation: Freq
keyword: #p
keyword: freq=noraman
keyword: PBEPBE/SDD
title: #p freq=noraman PBEPBE/SDD
converged: NO YES NO NO
title: Mulliken charges:
elementType: Cl N N N C C C C C C C C C C C H H H H H H H H H H H H
charge: -0.060572 -0.417039 -0.047554 -0.558438 0.365871 0.279151 -0.331983 -0.026700 -0.443141 -0.323690 -0.334829 -0.294466 -0.275034 -0.384256 -0.088367 0.215307 0.215402 0.307929 0.220064 0.219405 0.233952 0.195631 0.286891 0.255514 0.233657 0.278593 0.278699
chargesum: 0.00000
title: Mulliken charges with hydrogens summed into heavy atoms:
elementType: Cl N N N C C C C C C C C C C C
charge: -0.060572 -0.109110 -0.047554 -0.001146 0.365871 0.279151 0.098726 -0.026700 -0.003672 -0.089737 -0.139197 -0.007574 -0.019519 -0.150599 -0.088367
polarizability: 2.39787792e+02 1.64298396e+01 1.63271081e+02 4.61331569e-03 -7.31519011e-03 7.08698464e+01
1716.lowfreq: -0.0022 -0.0021 -0.0008 6.6556 9.2073 16.3192 38.7231 72.2711 74.3127
frequency: 38.6325 71.9033 74.3101 83.0036 118.6365 160.1082 186.9087 237.2044 242.6762 261.3427 278.5953 281.7963 344.0067 354.2387 419.1836 428.0036 480.5711 502.3473 512.6647 528.6593 575.2531 616.0081 638.3533 641.8258 739.5799 758.2789 777.4808 807.1106 828.3451 834.2134 867.6851 896.7919 931.6542 950.0767 970.4139 1013.1247 1027.0474 1062.2829 1092.8180 1122.7925 1133.9324 1165.0367 1170.6085 1208.8286 1243.6509 1271.6925 1290.5342 1326.7199 1332.3879 1333.5023 1359.3232 1379.1964 1391.7395 1416.0538 1440.5265 1468.1147 1469.6167 1490.5132 1532.2594 1560.6713 1584.9549 1611.0432 1642.6109 2939.2007 2978.8126 2983.4080 3040.7002 3114.6511 3118.1581 3174.1669 3175.4734 3184.2991 3496.3445 3573.0990 3626.3126
redmass: 5.1833 1.9004 5.5027 3.3136 3.6226 2.7591 6.0908 6.7848 4.2613 1.1359 4.0701 3.7900 1.4213 6.9821 3.0410 2.6295 1.6637 3.3853 6.8443 4.3402 8.1273 5.9487 6.9876 3.3281 5.5271 1.7678 1.1240 2.4624 1.4285 6.5367 6.0717 1.4990 1.3485 1.4073 1.1543 4.9267 3.8560 1.8820 2.6273 4.0560 2.7512 1.3066 1.6487 2.1441 1.4588 1.2355 1.4699 1.8371 2.2937 1.1462 1.6860 1.8528 4.2380 2.6164 2.4934 1.7252 1.3477 1.0835 5.1305 3.9741 6.4864 6.6976 1.0918 1.0571 1.0597 1.1042 1.1058 1.0887 1.0899 1.0935 1.0949 1.0932 1.0446 1.0759 1.0998
irintensity: 0.5037 7.8846 0.7328 0.0042 0.0558 4.2670 7.0161 5.8315 0.0508 19.1705 3.8394 6.6511 84.3364 3.8086 68.2224 29.7632 266.0794 4.8959 1.5651 107.3981 9.9905 0.0527 11.4973 8.4884 8.0950 13.9672 17.1277 32.1731 26.9166 46.6643 48.8663 25.5133 0.0193 1.5233 1.0248 0.1144 21.2265 14.4540 2.2349 55.1672 24.4733 0.0121 2.8126 14.6514 1.3337 0.0187 4.2394 3.4094 67.0527 0.1908 11.2502 5.4995 73.3784 7.9194 41.9394 77.8375 3.6447 39.3886 68.3733 133.9664 349.8821 77.6127 40.5784 53.3489 47.5774 23.2884 53.5032 17.6579 29.2877 22.0397 4.3662 0.8370 3.6632 30.6924 3.7993
temp: 298.150 k
press: 1.00000 atm
elementType: 17 7 7 7 6 6 6 6 6 6 6 6 6 6 6 1 1 1 1 1 1 1 1 1 1 1 1
symmnumber: 1
zpe: 556168.3 jmol-1
zpe.correction: 0.211833 hartree
zpe.thermalcorrener: 0.226021 hartree
zpe.thermalcorrenthalpy: 0.226965 hartree
zpe.thermalcorrgfe: 0.169964 hartree
zpe.sumelectzpe: -1049.599998 hartree
zpe.sumelectthermal: -1049.585810 hartree
zpe.sumelectthermalent: -1049.584866 hartree
zpe.sumelectthermalfe: -1049.641867 hartree
dipole: 6.1509 -1.7619 0.0089
dipole: 6.3983
quadrupole: -93.0908 -96.7344 -97.5426
quadrupole: 9.1297 0.0275 -0.0162
quadrupole: 2.6985 -0.9451 -1.7533 9.1297 0.0275 -0.0162
hfenergy: -1049.8118308 hartree
pointgroup: C01 [X(C11H12Cl1N3)]
dipole: 2.4557876 0.5529788 -0.0036332 debye
polarizability: 237.6499593|-20.7108374|165.4085585|-0.1198598|0.1723727|70.8702014 unknown
InChI: InChI=1S/C11H12ClN3/c12-8-1-2-9-10(15-6-4-13)3-5-14-11(9)7-8/h1-3,5,7,15H,4,6,13H2
charge 0 multiplicity 1
27 atoms
Cl -4.941821 1.475795 0.004002
N  1.937475 0.450473 -0.001209
N  -1.363813 -2.284478 -0.003563
N  5.714706 0.945575 -0.001708
C  0.866563 -0.424241 -0.001747
C  -0.504073 0.069741 0.000227
C  3.34263 0.026997 -0.003722
C  -1.573218 -0.908943 -0.001236
C  4.286235 1.263449 0.001758
C  1.053455 -1.825936 -0.003898
C  -0.845829 1.458426 0.003616
C  -2.934399 -0.459777 -0.00012
C  -2.178129 1.884863 0.004786
C  -0.075536 -2.688524 -0.004547
C  -3.207019 0.902847 0.002654
H  3.560127 -0.591662 -0.900698
H  3.560079 -0.599427 0.887664
H  1.754784 1.452989 -0.005248
H  4.064195 1.880939 0.894557
H  4.062044 1.890456 -0.883952
H  2.054888 -2.262463 -0.005585
H  -0.07015 2.233953 0.006122
H  -3.721043 -1.217966 -0.001424
H  -2.431095 2.94837 0.007558
H  0.082625 -3.774329 -0.006293
H  6.078614 0.524225 -0.858274
H  6.081303 0.517948 0.850577
