program: Gaussian 09
title: 000221179
version: EM64L-G09RevD.01
frameworkgroup: C1[X(C18H34O)]
method: RPBEPBE
basis: SDD
operation: Freq
keyword: #pfreq=noraman
keyword: PBEPBE/SDD
title: #p freq=noraman PBEPBE/SDD
converged: YES YES NO NO
title: Mulliken charges:
elementType: O C C C C C C C C C C C C C C C C C C H H H H H H H H H H H H H H H H H H H H H H H H H H H H H H H H H H
charge: -0.222085 0.301253 -0.443975 0.012835 0.328661 -0.438120 -0.199355 -0.519153 0.378320 -0.724908 -0.720476 -0.705200 -0.765549 -0.265553 -0.742675 -0.726290 -0.725630 -0.740819 -0.255205 0.201534 0.197020 0.200823 0.246517 0.178258 0.202238 0.205009 0.215997 0.208873 0.217406 0.207196 0.212091 0.208105 0.210689 0.198249 0.212521 0.213402 0.219243 0.215844 0.209949 0.245125 0.217468 0.206635 0.209840 0.219168 0.202931 0.217581 0.216293 0.207077 0.207508 0.253185 0.209686 0.212812 0.167649
chargesum: 0.00000
title: Mulliken charges with hydrogens summed into heavy atoms:
elementType: O C C C C C C C C C C C C C C C C C C
charge: -0.222085 0.301253 -0.045420 0.213658 0.328661 -0.013345 0.002883 -0.098148 0.378320 -0.091432 -0.089591 -0.081029 -0.094630 -0.046309 -0.108732 -0.086610 -0.094751 -0.065136 -0.087556
polarizability: 2.45584978e+02 1.61828279e+00 1.89457278e+02 1.05292717e+00 5.31842000e+00 1.71580103e+02
1716.lowfreq: -18.8053 -12.0724 -11.0247 -0.0009 -0.0004 -0.0002 3.1978 18.8309 27.0866
frequency: -6.2631 18.5290 26.7719 38.3833 44.8088 65.2544 92.6956 117.4827 149.9836 158.6525 175.9859 181.5724 195.8492 202.7229 204.0618 212.6559 218.2350 234.3383 243.2165 250.7245 257.2351 266.1346 274.3132 278.4449 288.8434 321.3177 326.9052 334.5079 349.1233 361.5827 378.1180 399.0497 401.7556 419.0648 437.2138 445.3414 470.6510 484.1581 521.6169 556.7785 648.3937 727.2763 731.3771 742.2946 834.9465 843.9336 859.7054 879.0772 880.2015 909.8160 917.5142 918.8850 923.6598 925.4750 927.4239 934.1103 940.0326 949.5981 958.3168 969.5416 998.0481 1003.2574 1008.7106 1010.9343 1038.0907 1043.1309 1072.1361 1073.6695 1082.4464 1111.9118 1133.4035 1161.8293 1170.7232 1197.6519 1210.0504 1214.5514 1239.3716 1250.3537 1252.7238 1270.7116 1275.8055 1281.5471 1289.0005 1296.4630 1327.5330 1331.6201 1341.0665 1345.5837 1368.1284 1371.3331 1372.4509 1374.0044 1375.2217 1383.1972 1387.5722 1397.5564 1400.1444 1404.6834 1450.7106 1454.7721 1457.2188 1458.5444 1459.2145 1464.0916 1466.1248 1466.1952 1467.9109 1471.0956 1474.8846 1478.9974 1481.3863 1483.4611 1485.9076 1486.9212 1490.5784 1494.8318 1496.2101 1581.1054 1620.4579 2898.6372 2945.0403 2953.7727 2960.4392 2961.3096 2962.5246 2963.8558 2964.3165 2970.4553 2971.2258 2971.4958 2972.9149 2979.3956 2984.7368 3006.4940 3040.8855 3042.3521 3055.4827 3055.8060 3057.1268 3058.9429 3059.5337 3059.9254 3061.4295 3062.7710 3063.9623 3064.1965 3066.7244 3068.1206 3069.4681 3069.9159 3077.9542 3085.6913 3094.7036
redmass: 3.4972 2.8650 3.1955 3.4460 3.6737 3.4654 2.8418 2.9221 2.9857 2.4653 2.0688 2.6195 2.7317 1.1782 1.2775 2.0489 1.4523 2.0827 1.0901 1.2149 1.1824 1.0651 1.0675 1.8568 2.0477 2.3666 2.2826 2.1294 2.4029 2.4589 2.4513 1.9619 1.9912 2.7282 2.5984 2.1675 2.5014 2.7748 2.5904 2.7611 3.8235 3.0478 3.2426 2.8651 2.4109 1.5902 1.7699 2.0187 1.6672 1.6822 1.6821 1.7620 1.5852 1.6294 1.6939 1.2205 1.2249 2.0049 1.7744 1.7683 1.4979 1.4784 1.5358 1.4546 1.8056 1.8533 1.8882 1.9842 2.1927 1.9291 2.0298 1.7074 1.4167 1.7420 2.4062 2.2346 1.7526 2.7016 2.8334 1.6031 1.3577 1.6382 1.6230 1.2984 1.4937 1.4238 1.4651 1.5571 1.2180 1.2225 1.2608 1.2101 1.2109 1.2081 1.2045 1.2139 1.2142 1.4116 1.0990 1.0732 1.0543 1.0670 1.0538 1.0496 1.0497 1.0489 1.0598 1.0464 1.0536 1.0505 1.0603 1.0603 1.0604 1.0555 1.0619 1.0604 1.0605 7.3958 5.8139 1.0836 1.0675 1.0587 1.0564 1.0392 1.0352 1.0373 1.0358 1.0369 1.0498 1.0382 1.0604 1.0435 1.0811 1.1008 1.0952 1.0909 1.1000 1.0999 1.0998 1.0991 1.0983 1.0994 1.0992 1.0963 1.0942 1.0983 1.0983 1.0985 1.0996 1.0983 1.0982 1.0975 1.0996
irintensity: 0.4434 0.2169 0.0462 0.1660 0.9520 0.8241 0.2447 0.4743 8.0734 0.1434 0.1522 2.5912 1.3840 0.3095 0.4698 2.6273 0.8975 0.1175 0.0866 0.2072 0.1705 0.0947 0.0923 0.2214 0.7090 0.6266 0.0231 0.0621 0.5556 0.2339 1.8940 0.2133 0.5096 0.8186 1.5906 0.8538 0.6008 0.2873 4.7406 10.4004 1.7102 7.0822 2.9059 17.3478 4.5133 2.8235 1.8686 1.1556 1.8255 10.6480 3.8253 9.2236 1.1521 0.6790 2.7584 0.5277 0.3160 10.5553 6.6241 1.2338 1.4530 1.5316 3.7847 0.3049 8.7098 0.3499 2.8031 8.9796 8.4920 4.6584 4.7795 2.7684 17.8118 13.5103 7.6506 13.4083 1.7727 7.4616 18.9827 2.8580 1.7285 8.8938 9.0838 1.5696 9.9999 3.9629 13.5518 1.9838 13.0442 52.9972 12.5045 17.6658 16.1599 25.6027 20.6812 12.8727 10.5009 1.9870 12.8095 2.0182 0.7197 0.4688 0.6999 2.6646 3.2530 1.7621 2.3318 17.7387 3.4896 14.5415 16.3584 13.4387 12.9427 12.9088 18.2266 47.9238 2.7512 144.1033 63.3027 90.5411 11.2606 28.0773 55.8709 34.3195 28.1358 19.7506 80.2311 25.7764 10.7268 15.5728 35.3179 36.4780 31.1918 40.4247 6.0122 0.1564 0.0353 1.6401 5.3837 5.8220 18.1809 31.6950 24.5332 9.6155 90.6819 85.8958 48.2083 100.4810 58.8402 126.4916 55.3684 28.9305 18.2446
temp: 298.150 k
press: 1.00000 atm
elementType: 8 6 6 6 6 6 6 6 6 6 6 6 6 6 6 6 6 6 6 1 1 1 1 1 1 1 1 1 1 1 1 1 1 1 1 1 1 1 1 1 1 1 1 1 1 1 1 1 1 1 1 1 1
symmnumber: 1
zpe: 1247492.8 jmol-1
zpe.correction: 0.475145 hartree
zpe.thermalcorrener: 0.499261 hartree
zpe.thermalcorrenthalpy: 0.500205 hartree
zpe.thermalcorrgfe: 0.422231 hartree
zpe.sumelectzpe: -779.948993 hartree
zpe.sumelectthermal: -779.924877 hartree
zpe.sumelectthermalent: -779.923933 hartree
zpe.sumelectthermalfe: -780.001908 hartree
dipole: 3.8753 1.1381 0.9932
dipole: 4.1593
quadrupole: -131.8926 -125.7733 -122.6935
quadrupole: -10.0580 -3.9165 -1.4226
quadrupole: -5.1061 1.0132 4.0929 -10.0580 -3.9165 -1.4226
hfenergy: -780.4241382 hartree
pointgroup: C01 [X(C18H34O1)]
dipole: 1.4636394 -0.4208272 -0.5986848 debye
polarizability: 243.090395|1.2311835|190.3576215|-13.6027426|3.0316361|173.1743435 unknown
InChI: InChI=1S/C18H34O/c1-14(11-17(3,4)5)9-10-16(13-19)15(2)12-18(6,7)8/h10,13-15H,9,11-12H2,1-8H3
charge 0 multiplicity 1
53 atoms
O  -3.090271 2.320435 1.056309
C  3.563606 -0.884123 -0.847202
C  2.980207 0.538664 -1.140623
C  2.306418 1.297283 0.046206
C  -2.410949 -1.780499 1.122702
C  -3.198801 -0.728976 0.273769
C  -2.444382 0.098342 -0.814041
C  1.009942 2.052994 -0.405678
C  -1.438504 1.13124 -0.288647
C  4.577504 -0.855807 0.327154
C  4.294375 -1.372286 -2.128273
C  2.420612 -1.881006 -0.516819
C  3.27362 2.31847 0.696349
C  -0.136301 1.126062 -0.738976
C  -1.613563 -2.754872 0.215149
C  -1.447519 -1.108466 2.138421
C  -3.466007 -2.597083 1.92262
C  -3.483985 0.800411 -1.736986
C  -1.899073 2.181846 0.649719
H  3.797246 1.175251 -1.540415
H  2.255252 0.422382 -1.972978
H  2.006936 0.564296 0.822761
H  -3.712026 -0.026194 0.957081
H  -3.99829 -1.282539 -0.263663
H  -1.873489 -0.610794 -1.44776
H  0.732648 2.784811 0.373144
H  1.268083 2.644633 -1.311537
H  5.01775 -1.859598 0.478654
H  4.096728 -0.556434 1.276622
H  5.405913 -0.150691 0.124059
H  4.700291 -2.391679 -1.986612
H  3.605819 -1.399358 -2.994504
H  5.137724 -0.703478 -2.385582
H  1.71004 -1.961444 -1.362113
H  2.829721 -2.890474 -0.32343
H  1.849424 -1.576575 0.380128
H  0.127434 0.325808 -1.450689
H  2.825284 2.782979 1.594859
H  3.517798 3.129186 -0.017432
H  4.22141 1.841304 0.999047
H  -0.781095 -2.245851 -0.305104
H  -1.175286 -3.573187 0.817885
H  -2.269145 -3.211748 -0.55121
H  -1.991098 -0.391543 2.782552
H  -0.985342 -1.872114 2.793403
H  -0.634895 -0.560857 1.630198
H  -4.0843 -1.931273 2.554096
H  -2.974577 -3.335847 2.584052
H  -4.144841 -3.146092 1.242276
H  -4.123295 1.485204 -1.153916
H  -4.133802 0.047345 -2.220482
H  -2.983626 1.382968 -2.532515
H  -1.116022 2.890975 1.009671
