program: Gaussian 09
title: 000221307
version: EM64L-G09RevD.01
frameworkgroup: C1[X(C19H17NO5)]
method: RPBEPBE
basis: SDD
operation: Freq
keyword: #p
keyword: freq=noraman
keyword: PBEPBE/SDD
title: #p freq=noraman PBEPBE/SDD
converged: NO NO NO NO
title: Mulliken charges:
elementType: O O O O O N C C C C C C C C C C C C C C C C C C C H H H H H H H H H H H H H H H H H
charge: -0.257353 -0.258444 -0.288934 -0.305271 -0.312633 -0.032502 0.196573 0.490173 -0.085869 0.456855 -0.498254 0.172361 0.179634 -0.556132 -0.354938 -0.563520 -0.561782 0.238877 0.274418 -0.203920 0.023112 -0.392732 -0.517279 -0.527913 -0.525828 0.297265 0.259834 0.235739 0.285099 0.289491 0.242240 0.242992 0.240159 0.214437 0.258448 0.227109 0.249720 0.226188 0.228217 0.258570 0.229619 0.226176
chargesum: 0.00000
title: Mulliken charges with hydrogens summed into heavy atoms:
elementType: O O O O O N C C C C C C C C C C C C C C C C C C C
charge: -0.257353 -0.258444 -0.288934 -0.305271 -0.312633 -0.032502 0.196573 0.490173 -0.085869 0.456855 -0.200990 0.172361 0.179634 -0.296298 -0.119200 -0.278421 -0.272291 0.238877 0.274418 0.281311 0.023112 -0.152573 0.182715 0.176212 0.188536
polarizability: 3.53038415e+02 8.04645198e+00 2.72564851e+02 -7.57977699e+00 8.13063892e+00 1.37824859e+02
1716.lowfreq: -38.9627 -12.4498 -0.0007 -0.0004 0.0007 1.0959 5.8153 9.7654 24.5276
frequency: -38.8867 -6.0471 24.5040 41.2373 48.3764 71.2344 77.0949 90.9687 110.6330 124.3972 141.4468 153.1699 162.6818 169.8984 192.5107 208.0113 237.7578 242.6027 248.7044 277.1119 287.4956 324.5374 334.6218 346.3413 370.3196 403.9109 407.2946 413.4904 456.4714 498.6142 517.2174 541.7913 571.6560 576.7311 619.4460 623.4431 647.2569 666.0786 676.6551 697.3996 707.0535 720.9999 759.5459 771.8305 793.9070 809.6446 822.0940 838.5741 867.8605 869.2619 875.0871 881.4320 893.9593 910.5241 930.3656 941.7475 960.6393 975.7514 990.0486 1034.5311 1042.2480 1060.2225 1064.4772 1102.3009 1110.2792 1111.5923 1113.5152 1119.8415 1148.4419 1152.1356 1157.8059 1169.3751 1181.1950 1209.6186 1218.9267 1232.6850 1250.7453 1273.8531 1333.4003 1348.0514 1355.7465 1361.2415 1380.9025 1395.3023 1412.5517 1425.3558 1435.2516 1436.9859 1451.6762 1454.0268 1457.9347 1459.9022 1467.1530 1476.9635 1482.4293 1483.8284 1485.7086 1490.2407 1556.8566 1567.2956 1603.7854 1616.9103 1637.1552 2973.7212 2978.0775 2980.7114 3019.3285 3071.6144 3078.9484 3086.7323 3099.6417 3120.4625 3120.7337 3125.8310 3130.2508 3155.2953 3164.5259 3173.6549 3182.0704 3193.5002
redmass: 2.2520 1.9400 4.1718 4.2087 5.2802 3.7696 3.1312 2.9377 4.0017 6.8802 2.3583 1.3564 1.2347 1.8001 4.5069 3.9547 4.9688 5.4607 5.0441 5.4240 5.5631 4.4347 6.5616 6.8927 5.2089 5.8989 4.1488 5.7060 5.7055 5.5227 5.3859 4.3359 6.5351 6.0590 5.1436 7.6614 4.6513 5.0343 8.0021 7.2725 5.1199 6.8271 4.0413 7.2783 3.7886 4.7856 1.2845 9.0750 4.7167 5.9653 1.7754 1.5542 1.7392 1.3636 7.3454 8.6459 1.4185 5.8356 5.7779 5.9629 3.8074 2.3751 1.4578 2.3849 1.2427 1.2407 1.2456 1.0375 1.4112 1.3628 1.4584 2.6682 1.9121 1.4255 1.5451 1.8384 3.6365 3.7270 5.6029 5.2296 5.0695 1.4026 2.8670 2.7891 1.6522 1.6875 1.2767 1.4563 1.1982 3.1386 1.0540 1.1293 2.5448 1.0646 1.0564 1.1620 1.0650 4.0846 7.2134 7.8356 7.1191 9.1151 8.1972 1.0305 1.0297 1.0329 1.0536 1.1042 1.1049 1.0993 1.1186 1.1028 1.1035 1.1045 1.0868 1.0986 1.0917 1.0933 1.0923 1.0927
irintensity: 14.6620 2.7877 1.6296 1.1593 0.8501 1.5313 3.3060 6.4585 0.2675 2.7955 1.5971 1.6564 1.0070 2.0355 0.0386 3.4379 5.7273 5.6340 5.2094 5.2006 9.2610 3.8907 0.4498 0.8778 4.0374 2.6098 3.6223 4.0480 6.6399 3.7257 0.4670 3.3632 1.6179 0.6834 1.0234 39.1341 7.7889 7.2600 1.7227 1.3482 4.4748 1.7759 13.8109 6.9053 1.3263 15.9202 5.4966 41.3005 7.1267 4.2717 17.6700 83.0058 21.0085 14.8741 60.6944 59.6206 0.1812 152.1517 95.9895 136.8766 17.8980 14.3018 4.5732 21.1409 8.7255 6.2826 4.7169 0.0106 3.5094 2.6481 14.3038 45.9912 76.7668 18.2465 13.4284 56.1823 152.3500 63.0476 121.4981 108.5809 53.8632 2.3103 11.2186 94.2420 51.2374 67.6852 33.3669 34.9876 21.9208 256.5202 11.7484 13.1792 24.1907 1.8500 25.8471 11.1654 29.7336 28.7858 107.7187 18.5051 13.6636 12.0767 5.6090 78.0168 68.1742 92.6204 132.4074 25.0640 20.2895 37.2071 26.9366 23.9372 28.9303 15.6272 6.0021 43.4422 1.2701 3.8878 0.8081 5.2375
temp: 298.150 k
press: 1.00000 atm
elementType: 8 8 8 8 8 7 6 6 6 6 6 6 6 6 6 6 6 6 6 6 6 6 6 6 6 1 1 1 1 1 1 1 1 1 1 1 1 1 1 1 1 1
symmnumber: 1
zpe: 836841.6 jmol-1
zpe.correction: 0.318736 hartree
zpe.thermalcorrener: 0.340124 hartree
zpe.thermalcorrenthalpy: 0.341068 hartree
zpe.thermalcorrgfe: 0.267735 hartree
zpe.sumelectzpe: -1163.228397 hartree
zpe.sumelectthermal: -1163.207009 hartree
zpe.sumelectthermalent: -1163.206065 hartree
zpe.sumelectthermalfe: -1163.279399 hartree
dipole: -0.2944 -1.8361 -0.0465
dipole: 1.8601
quadrupole: -110.3047 -136.6127 -143.7068
quadrupole: 0.4746 1.4373 3.0797
quadrupole: 19.9034 -6.4047 -13.4987 0.4746 1.4373 3.0797
hfenergy: -1163.5471333 hartree
pointgroup: C01 [X(C19H17N1O5)]
dipole: -0.0979873 -0.6984907 0.19517 debye
polarizability: 350.9978435|4.4202939|266.1285723|-22.0734433|-30.482606|146.3017091 unknown
InChI: InChI=1S/C19H17NO5/c1-21-16-7-12(8-17(22-2)19(16)23-3)18-13-9-15-14(24-10-25-15)6-11(13)4-5-20-18/h4-9H,10H2,1-3H3
charge 0 multiplicity 1
42 atoms
O  -3.573379 -2.808839 0.061669
O  -5.579359 -1.507559 0.275058
O  2.435475 -2.006516 1.718978
O  3.879277 0.949808 -2.001705
O  4.497187 -1.211527 -0.183535
N  -0.640403 2.667492 -0.322757
C  -1.937507 0.589724 -0.071562
C  -3.166064 1.371378 0.006584
C  -0.685968 1.315304 -0.18877
C  0.649742 0.640211 -0.170215
C  -2.013453 -0.851062 -0.073036
C  -3.262316 -1.427722 0.049297
C  -4.45756 -0.657309 0.169233
C  -4.444572 0.723122 0.142963
C  -3.067311 2.793809 -0.092981
C  1.65298 1.089184 -1.064784
C  0.969352 -0.37177 0.769413
C  2.249727 -0.971103 0.786162
C  2.93041 0.501442 -1.052163
C  -5.045318 -2.896631 0.233913
C  3.234618 -0.567006 -0.158749
C  -1.815891 3.381327 -0.285185
C  3.699653 -2.031987 2.484243
C  5.098956 1.558066 -1.42006
C  4.738133 -1.99855 -1.419345
H  -1.118855 -1.463674 -0.19097
H  -5.365121 1.308889 0.206696
H  -3.968939 3.412808 -0.038625
H  1.44788 1.909929 -1.756049
H  0.252133 -0.693061 1.529749
H  -5.267732 -3.39315 1.193925
H  -5.479204 -3.419721 -0.634559
H  -1.710999 4.465344 -0.40235
H  3.856394 -1.068804 3.005992
H  4.557969 -2.238806 1.824874
H  3.564426 -2.839924 3.219593
H  5.612599 0.84788 -0.747656
H  4.833907 2.479673 -0.868658
H  5.739245 1.807473 -2.279956
H  4.682193 -1.346884 -2.309126
H  3.996988 -2.815276 -1.497749
H  5.750709 -2.415986 -1.308194
