program: Gaussian 09
title: 000221169
version: EM64L-G09RevD.01
frameworkgroup: C1[X(C10H12O2)]
method: RPBEPBE
basis: SDD
operation: Freq
keyword: #pfreq=noraman
keyword: PBEPBE/SDD
title: #p freq=noraman PBEPBE/SDD
converged: YES YES NO NO
title: Mulliken charges:
elementType: O O C C C C C C C C C C H H H H H H H H H H H H
charge: -0.263819 -0.184699 -0.280083 0.457115 -0.725289 -0.374627 -0.383534 -0.352293 -0.362899 0.319590 -0.057560 -0.537884 0.244024 0.239866 0.236807 0.206097 0.243989 0.227956 0.252230 0.239620 0.165629 0.221078 0.221660 0.247026
chargesum: 0.00000
title: Mulliken charges with hydrogens summed into heavy atoms:
elementType: O O C C C C C C C C C C
charge: -0.263819 -0.184699 -0.036059 0.457115 -0.042520 -0.130637 -0.155577 -0.100063 -0.123279 0.319590 0.108069 0.151880
polarizability: 1.68836859e+02 -3.52897960e+00 1.06459971e+02 -3.65768794e+00 9.78423977e+00 7.39533629e+01
1716.lowfreq: -9.8691 -9.3005 -1.9710 -0.0007 -0.0005 0.0006 14.7424 48.2828 77.0026
frequency: 12.3481 48.2233 76.9999 121.7350 160.6516 202.5497 222.3581 247.3641 267.5144 281.0899 373.6998 384.7270 411.1809 414.5446 487.1115 533.4248 556.0691 630.2815 711.0728 731.1781 799.1468 811.0962 833.9306 879.4677 935.1126 938.0256 967.1776 987.0077 1000.4692 1036.6499 1065.0617 1112.5141 1115.9498 1124.9690 1157.5742 1181.0715 1196.6554 1233.1408 1246.4254 1293.7134 1320.1220 1377.5965 1384.5389 1389.6410 1419.9775 1436.6408 1467.0744 1472.7256 1473.0790 1483.8206 1499.6242 1580.9925 1619.4842 1639.8245 2851.9355 2959.9464 2983.5773 3028.3314 3047.9701 3077.0761 3091.0461 3126.2450 3128.8794 3137.0152 3163.1425 3168.5023
redmass: 3.9231 7.6285 3.5480 3.6842 3.0953 1.8848 1.1454 1.5298 2.5096 2.6677 3.5331 5.1083 3.5156 3.4689 3.7185 2.4132 4.6656 6.9686 3.3953 3.7267 4.4913 1.3779 1.5023 1.6943 1.6175 1.5769 1.3545 8.5296 2.8274 1.7430 2.3897 1.2616 1.9309 1.5788 1.3356 1.2885 2.1063 2.9764 1.5398 1.3938 1.4504 1.2300 3.3598 1.2034 3.4278 1.1679 1.0501 1.0720 1.0560 1.0599 2.3264 6.9243 6.4515 8.0351 1.0849 1.0330 1.0356 1.0854 1.1040 1.0981 1.1007 1.0993 1.0897 1.0875 1.0944 1.0956
irintensity: 0.5098 2.8196 4.2918 4.4197 0.9384 2.2564 1.6740 1.2548 4.2342 4.9623 2.7829 1.0797 6.9849 6.9808 2.6637 38.8883 7.2179 0.2210 15.1952 3.2695 1.2212 18.5374 29.0058 55.7225 3.6041 1.6012 0.2754 47.5264 14.5207 10.3646 2.1868 0.3720 10.5408 13.6262 1.4504 66.7166 14.8371 151.0914 11.9817 1.5045 1.8882 0.3025 14.6721 12.2190 3.1411 10.7854 13.6107 21.2437 53.6574 15.1664 119.9536 15.4299 31.7793 255.6784 89.8015 67.0056 24.5176 8.2781 48.9808 38.1217 22.2052 26.5596 8.7899 9.9911 16.0500 3.4629
temp: 298.150 k
press: 1.00000 atm
elementType: 8 8 6 6 6 6 6 6 6 6 6 6 1 1 1 1 1 1 1 1 1 1 1 1
symmnumber: 1
zpe: 509119.3 jmol-1
zpe.correction: 0.193913 hartree
zpe.thermalcorrener: 0.206109 hartree
zpe.thermalcorrenthalpy: 0.207053 hartree
zpe.thermalcorrgfe: 0.153837 hartree
zpe.sumelectzpe: -537.787708 hartree
zpe.sumelectthermal: -537.775512 hartree
zpe.sumelectthermalent: -537.774568 hartree
zpe.sumelectthermalfe: -537.827784 hartree
dipole: -2.7476 3.7480 -0.1737
dipole: 4.6505
quadrupole: -71.5055 -70.6973 -72.4746
quadrupole: 3.8833 -7.7743 5.3624
quadrupole: 0.0536 0.8618 -0.9155 3.8833 -7.7743 5.3624
hfenergy: -537.9816209 hartree
pointgroup: C01 [X(C10H12O2)]
dipole: 1.0173004 0.6391751 1.3799188 debye
dipolederiv: -1.7821502 -0.3641832 -0.0464508 -0.3059549 -0.3916945 -0.0211171 0.0736645 0.0041359 -0.306104 -0.6428999 -0.0113647 -0.3233622 -0.12979 -0.4191574 -0.0753785 -0.6433344 0.0111565 -0.7192659 -0.1846704 0.058563 -0.1979342 0.2209308 0.0345387 0.1133077 -0.1561034 0.0500706 -0.1218386 0.1337929 -0.0257682 0.0132064 0.0985824 -0.1455493 0.0088812 -0.0645925 -0.0263186 -0.2063577 0.0035111 0.0318936 -0.0144228 -0.0235158 0.0573637 0.051989 0.011165 -0.0186199 0.0094092 0.0912855 0.0081254 -0.0493623 0.0178086 -0.0024888 0.1160227 -0.0823034 0.1415998 -0.0107516 0.1199555 0.1001688 0.0399718 0.0558842 -0.0231691 0.1317931 -0.0486473 0.104846 -0.0032767 -0.3665955 -0.0367232 0.0007155 -0.2360142 -0.0822005 0.1156689 -0.1655485 0.0842739 -0.0454143 -0.4037611 -0.0492517 -0.0315214 0.2180998 -0.0746673 0.0663858 0.2854806 0.1238615 -0.1260531 1.5882053 0.2636573 -0.0704261 0.0657826 0.0764466 -0.0464549 -0.3087892 -0.0865542 0.0721721 0.5947311 0.0187455 0.5812697 -0.1454323 0.7143571 -0.1315173 0.9658885 -0.0173131 0.7934675 0.6086303 0.1466383 0.0844168 0.4244019 0.4415965 0.0248561 0.3214272 0.0721742 0.328318 0.0032481 -0.0199327 0.0145855 -0.0473613 -0.0943034 -0.022821 0.0028519 -0.0633172 0.0235868 0.0718894 0.0610358 -0.0894825 0.0549796 0.0381058 0.0588807 -0.0505909 0.0752503 -0.0572976 -0.1725675 -0.0459204 0.0640402 -0.0498697 0.0925996 0.0014064 0.0167144 -0.0068949 0.0792437 0.1071834 -0.0572004 -0.0168067 -0.0141185 -0.1427331 -0.0642924 0.0121797 -0.0045257 0.0686826 0.0316357 -0.0897245 -0.0513489 -0.0649126 0.0333588 -0.0779889 -0.0407559 -0.0772902 0.0708445 0.0540536 0.0540759 0.072711 0.0728091 0.0565755 -0.0944561 0.0682802 -0.0886212 0.0226355 0.0449267 0.0419205 0.0668439 0.0356398 0.0822843 -0.0900227 0.0728006 -0.0898328 0.069199 0.0212803 -0.0791202 -0.0435139 -0.0993601 0.041914 -0.0962131 -0.0474161 -0.0985463 0.0844842 0.1191956 -0.0717054 -0.0589395 0.0011931 -0.2491141 -0.008304 -0.0799366 -0.0836096 0.0090622 0.0656789 -0.0193987 0.0401974 -0.0931991 0.0238573 0.0367011 -0.1264265 -0.0002198 -0.1743429 0.0423358 0.1047183 -0.031831 -0.0693895 -0.170995 0.0259812 -0.0977155 0.0091105 0.0502847 -0.1488947 -0.0192493 0.0474443 0.0128061 0.1030747 -0.0233079 0.0817079 -0.0148154 0.0893122 unknown
polarizability: 167.360887|11.7278539|88.3177577|0.6785575|18.8481344|93.5715486 unknown
InChI: InChI=1S/C10H12O2/c1-8(7-11)9-3-5-10(12-2)6-4-9/h3-8H,1-2H3
charge 0 multiplicity 1
24 atoms
O  3.310805 -0.084596 -0.485416
O  -3.714416 -0.164045 -1.684106
C  -2.382709 -0.637171 0.352066
C  -0.866223 -0.468436 0.203317
C  -2.941211 -0.250019 1.74316
C  -0.166704 -1.269949 -0.742644
C  -0.128955 0.500844 0.924688
C  1.214887 -1.122382 -0.947256
C  1.262802 0.664479 0.732878
C  1.937515 -0.150867 -0.208027
C  -3.041919 0.251104 -0.713128
C  4.101269 0.910195 0.243691
H  -2.65744 -1.682727 0.121519
H  -2.409452 -0.800471 2.53917
H  -4.01662 -0.492197 1.80901
H  -2.831122 0.83198 1.944499
H  -0.716751 -2.019287 -1.324583
H  -0.63035 1.134789 1.664241
H  1.75535 -1.742197 -1.668962
H  1.80023 1.418893 1.31532
H  -2.857197 1.347855 -0.557277
H  4.078084 0.721943 1.334865
H  3.744985 1.938157 0.036527
H  5.128344 0.791205 -0.130951
